{"text_format":"1","workbook":"xlsx","n_sheets":36,"sheets":["MENÙ","iDG","iUF","iUI","iCONDOMINI","iTABUF","iPCU","iPCE","iPCDC","iPCF","iTERZI","iFONDI","iFondiCD","iUSCITE_P","iRP_DEPOSITI","iGIORNALE","cTABUI","cTABCO","hEsempiScrittureContabili","mf01","mf02","mf03","mf04","mf05","mf06","mf07","mf08","mr01","mr02","md01","mRICEVUTA","mBOLLETTINO","mCOPERTINA","iPromemoria1","iPromemoria2","iRP_ATTREZZATURE"],"not_rendered":{"charts":0,"images":5,"macros":1,"external_links":0,"defined_names":83,"comments":7,"pivot_tables":0},"unopened":[],"bounds":{"document_bytes":16777216,"sheet_cells":100000,"rows_first":2000,"rows_last":500,"rows_between":2000,"halvings":0,"cell_chars":16384,"cell_head_chars":4096},"cells_cut":0,"cells_raw":0,"read":"whole","date_system":"1900"}

{"sheet":"MENÙ","index":0,"n_rows":71,"n_cols":35,"rows_kept":71,"cut":false,"hidden":false,"merged":[[3,13,3,25],[5,15,5,23],[4,13,4,25],[2,5,2,8],[3,5,3,8],[4,5,4,8],[5,5,5,8],[4,30,4,31],[4,32,4,33],[28,5,29,8],[28,10,29,13],[28,15,29,18],[13,5,14,8],[13,10,14,23],[8,5,8,8],[8,30,8,33],[7,4,7,9],[7,29,7,34],[5,30,5,31],[5,32,5,33],[10,15,12,23],[7,10,8,28],[25,15,27,23],[56,5,57,8],[56,10,57,18],[56,30,57,33],[53,15,55,23],[56,20,57,23],[56,25,57,28],[46,10,47,13],[46,15,47,18],[28,25,29,28],[28,30,29,33],[28,20,29,23],[34,20,35,23],[43,15,44,18],[37,10,38,13],[13,25,14,33],[44,5,45,8],[41,30,42,33],[35,25,36,28],[39,10,41,13],[43,10,44,13]]}
["\nDATI GENERALI"]
[null,null,null,null,null,null,null,null,null,null,null,null,null,null,null,null,null,null,null,null,null,null,null,null,null,null,null,null,null,null,null,null,null,null,""]
[null,null,null,null,null,{"$f":"iDG!B12","v":"Amministratore"},null,null,null,null,null,null,null,"Condominio Palazzo Duck"]
[null,null,null,null,null,{"$f":"iDG!B13","v":"dott. Pico de Paperis"},null,null,null,null,null,null,null,"Viale dei Platani 1",null,null,null,null,null,null,null,null,null,null,null,null,null,null,"2026-12-31"]
[null,null," ",null,null,{"$f":"iDG!B14","v":"Viale degli Alberi Fioriti 22"},null,null,null,null,null,null,null,"99999 PAPEROPOLI (PP)",null,null,null,null,null,null,null,null,null,null,null,null,null,null,null,null,"Codice Condominio",null,"Esercizio"]
[null,null,null,null,null,{"$f":"iDG!B15 & \" \" & iDG!B16 & \" (\" & iDG!B17 & \")\"","v":"99999 PAPEROPOLI (PP)"},null,null,null,null,null,null,"99999990799",null,null,{"$f":"iDG!B38","v":"palduck@ggggmail.com"},null,null,null,null,null,null,null,null,null,null,null,null,null,null,{"$f":"iDG!B41","v":"PalDuck"},null,{"$f":"iDG!B97","v":2024}]
[]
[null,null,null,null,"Il GIORNALE CONTABILE è aggiornato al",null,null,null,null,null,null,null,null,null,null,null,null,null,null,null,null,null,null,null,null,null,null,null,null,"Data di elaborazione"]
[null,null,null,null,null,"06/06/2024",null,null,null,null,null,null,null,null,null,null,null,null,null,null,null,null,null,null,null,null,null,null,null,null,"31/12/2024"]
[]
[null,null,null,null,null,null,null,null,null,null,null,null,null,null,null,"AMMINISTRATORE e CONDOMINIO"]
[]
[]
[null,null,null,null,null,"AMMINISTRATORE",null,null,null,null,"CONDOMINIO",null,null,null,null,null,null,null,null,null,null,null,null,null,null,"CONFIGURAZIONE DELLE STAMPE "]
[]
[null,null,null,null,null,null,null,null,null,null,null,null,null,null,0]
[null,null,null,"",null,null,null,null,null,null,null,null,null,null,0]
[null,null,null,""]
[null,null,null,""]
[null,null,null,""]
[null,null,null,""]
[null,null,null,""]
[null,null,null,""]
[null,null,null,""]
[null,null,null,""]
[null,null,null,"",null,null,null,null,null,null,null,null,null,null,null,"ESERCIZIO"]
[null,null,null,""]
[null,null,null,"",null,null,null,null,null,null,null,null,null,null,null,null,null,null,null,null,null,null,null,null,null,null,null,null,null,null,null,null,null,null,""]
[null,null,null,"",null,"ESERCIZIO",null,null,null,null,"ELAB. INIZIO ESERCIZIO",null,null,null,null,"ELAB. IN CORSO ESERCIZIO",null,null,null,null," ELABORAZIONI FISCALI",null,null,null,null,"ELABORAZIONI SUSSIDIARIE",null,null,null,null,"STAMPE IN PDF"]
[null,null,null,""]
[null,null,null,""]
[null,null,null,""]
[null,null,null,""]
[null,null,null,""]
[null,null,null,"",null,null,null,null,null,null,null,null,null,null,null,null,null,null,null,null,"SITUAZIONI CONTABILI",null,null,null,null,null,null,null,null,null,null,null,null,null,""]
[null,null,null,"",null,null,null,null,null,null,null,null,null,null,null,null,null,null,null,null,null,null,null,null,null,null,null,null,null,null,null,null,null,null,""]
[null,null,null,"",null,null,null,null,null,null,null,null,null,null,null,null,null,null,null,null,null,null,null,null,null,null,null,null,null,null,null,null,null,null,""]
[null,null,null,"",null,null,null,null,null,null,null,null,null,null,null,null,null,null,null,null,null,null,null,null,null,null,null,null,null,null,null,null,null,null,""]
[null,null,null,"",null,null,null,null,null,null,null,null,null,null,null,null,null,null,null,null,null,null,null,null,null,null,null,null,null,null,null,null,null,null,""]
[null,null,null,"",null,null,null,null,null,null,null,null,null,null,null,null,null,null,null,null,null,null,null,null,null,null,null,null,null,null,null,null,null,null,""]
[null,null,null,"",null,null,null,null,null,null,null,null,null,null,null,null,null,null,null,null,null,null,null,null,null,null,null,null,null,null,null,null,null,null,""]
[null,null,null,"",null,null,null,null,null,null,null,null,null,null,null,null,null,null,null,null,null,null,null,null,null,null,null,null,null,null,null,null,null,null,""]
[null,null,null,"",null,null,null,null,null,null,null,null,null,null,null,null,null,null,null,null,null,null,null,null,null,null,null,null,null,null,null,null,null,null,""]
[null,null,null,"",null,null,null,null,null,null,"COMPILAZIONI",null,null,null,null,null,null,null,null,null,null,null,null,null,null,null,null,null,null,null,null,null,null,null,""]
[null,null,null,"",null,null,null,null,null,null,null,null,null,null,null,null,null,null,null,null,null,null,null,null,null,null,null,null,null,null,null,null,null,null,""]
[null,null,null,"",null,null,null,null,null,null,null,null,null,null,null,null,null,null,null,null,null,null,null,null,null,null,null,null,null,null,null,null,null,null,""]
[null,null,null,"",null,null,null,null,null,null,null,null,null,null,null,null,null,null,null,null,null,null,null,null,null,null,null,null,null,null,null,null,null,null,""]
[null,null,null,"",null,null,null,null,null,null,null,null,null,null,null,null,null,null,null,null,null,null,null,null,null,null,null,null,null,null,null,null,null,null,""]
[null,null,null,"",null,null,null,null,null,null,null,null,null,null,null,null,null,null,null,null,null,null,null,null,null,null,null,null,null,null,null,null,null,null,""]
[null,null,null,"",null,null,null,null,null,null,null,null,null,null,null,null,null,null,null,null,null,null,null,null,null,null,null,null,null,null,null,null,null,null,""]
[null,null,null,"",null,null,null,null,null,null,null,null,null,null,null,null,null,null,null,null,null,null,null,null,null,null,null,null,null,null,null,null,null,null,""]
[null,null,null,"",null,null,null,null,null,null,null,null,null,null,null,null,null,null,null,null,null,null,null,null,null,null,null,null,null,null,null,null,null,null,""]
[null,null,null,""]
[null,null,null,"",null,null,null,null,null,null,null,null,null,null,null,"ALTRE FUNZIONI",null,null,null,null,null,null,null,null,null,null,null,null,null,null,null,null,null,null,""]
[null,null,null,"",null,null,null,null,null,null,null,null,null,null,null,null,null,null,null,null,null,null,null,null,null,null,null,null,null,null,null,null,null,null,""]
[null,null,null,"",null,null,null,null,null,null,null,null,null,null,null,null,null,null,null,null,null,null,null,null,null,null,null,null,null,null,null,null,null,null,""]
[null,null,null,"",null,"GUIDE",null,null,null,null,"ESPORTAZIONE e IMPORTAZIONE DATI",null,null,null,null,null,null,null,null,null,"ELAB. STRAORDINARIE",null,null,null,null,"ELAB. COMPLEMENTARI",null,null,null,null,"FINE UTILIZZO PROCEDURA",null,null,null,""]
[null,null,null,"",null,null,null,null,null,null,null,null,null,null,null,null,null,null,null,null,null,null,null,null,null,null,null,null,null,null,null,null,null,null,""]
[null,null,null,""]
[null,null,null,""]
[null,null,null,""]
[null,null,null,""]
[null,null,null,""]
[null,null,null,"",null,null,null,null,null,null,null,null,null,null,null,null,null,null,null,null,null,null,null,null,null,null,null,null,""]
[null,null,null,"",null,null,null,null,null,null,null,null,null,null,null,null,null,null,null,null,null,null,null,null,null,"","","","","","","","","",""]
[null,null,null,"",null,null,null,null,null,null,null,null,null,null,null,null,null,null,null,null,null,null,null,null,null,"","","","","","","","","",""]
[null,null,null,"",null,null,null,null,null,null,null,null,null,null,null,null,null,null,null,null,null,null,null,null,null,"","","","","","","","","",""]
[null,null,null,"",null,null,null,null,null,null,null,null,null,null,null,null,null,null,null,null,null,null,null,null,null,"","","","","","","","","",""]
[null,null,null,null,null,null,null,null,null,null,null,null,null,null,null,null,null,null,null,null,null,null,null,null,null,"","","","","","","","","",""]
[]
[null,null,null,null,null,null,null,null,null,null,null,null,null,null,null,null,null,null,null,null,null,null,null,null,"   "]

{"sheet":"iDG","index":1,"n_rows":151,"n_cols":5,"rows_kept":151,"cut":false,"hidden":true,"merged":[[149,3,149,4],[146,3,146,4],[147,3,147,4],[148,3,148,4],[126,3,126,4],[141,3,141,4],[142,3,142,4],[143,3,143,4],[144,3,144,4],[145,3,145,4],[1,1,1,4],[5,1,5,2],[5,3,5,4],[22,1,22,4],[23,1,23,4]]}
[null,"È consentito variare i valori delle sole celle con sfondo bianco.\nI dati delle righe con i testi in rosso scuro devono essere necessariamente forniti."]
[]
[]
[]
[null,{"$f":"iDG!B32","v":"Condominio Palazzo Duck"}]
[]
[]
[]
[]
[null,"VALORE","FORMATO","DESCRIZIONE E SIGNIFICATO"]
[null,"DATI RELATIVI ALL' AMMINISTRATORE"]
[null,"Amministratore","Testo","Caratteristica di chi amministra, ovvero \"in qualità di\""]
[null,"dott. Pico de Paperis","Testo","Titolo professionale, Cognome e Nome o Ragione Sociale"]
[null,"Viale degli Alberi Fioriti 22","Testo","Indirizzo"]
[null,99999,"Testo","CAP"]
[null,"PAPEROPOLI","Testo","Città"]
[null,"PP","Testo","Provincia"]
[null,null,"Testo","Telefono fisso"]
[null,"cell. 300-0707007","Testo","Cellulare"]
[null,null,"Testo","Indirizzo e-mail"]
[null,null,"Testo","Indirizzo pec"]
[null,null,"Immagine","Immagine della firma\nDimensione dell'immagine: L x H =  7,70 cm x 2,70 cm in cm stampati, che corrisponde per una risoluzione di 37,80 pixel/cm a L x H =  290 pixel x 100 pixel."]
[null,"La procedura produce, fra le altre, delle comunicazioni che normalmente prima di essere recapitate devono essere firmate dall'amministratore. \nQuesto può essere fatto apponendo una firma  manuale dopo la stampa oppure producendo le comunicazioni direttamente con l'immagine della firma già apposta. \nPer realizzare questo occorre, preventivamente, inserire l'immagine della firma sui moduli che la prevedono. \nI moduli sono i documenti base utilizzati dalla procedura per produrre i documenti effettivi."]
[null,"Per inserire l'immagine della firma su tutti i moduli che la prevedono è possibile seguire il seguente procedimento:\n  • Si scannerizza un foglio cartaceo sul quale l'amministratore ha apposto la sua firma ottendo così un file contenente l'immagine della firma. \n  • Tramite un programma di elaborazione immagini tipo PAINT.NET, si ritaglia l'immagine della firma e eventualmente la si ridimensiona in modo che sia contenuta in un rettangolo di 7,70 x 2,70 cm di lato. Poi si rende lo sfondo trasparente e infine si salva l'immagine della firma in un file il cui formato permette la trasparenza dello sfondo, quale il formato png.\n • Si inserisce nella cella B22 l'immagine della firma con il comando INSERISCI IMMAGINE DA QUESTO DISPOSITIVO e scegliendo il file .png nel quale la firma è stata salvata. \n • Dopo averla inserita occorre dare un nome all' immagine, e questo nome deve essere necessariamente \"firma\".  Per farlo si seleziona l'immagine cliccandoci sopra e si scrive \"firma\" nella Casella Nome di EXCEL ( è la prima casella della barra delle formule, ovvero quella che normalmente riporta il nome dell'elemento selezionato o della cella attiva, scrivendo solo \"firma\" senza le virgolette)\n • Dopo aver scritto il nome occorre necessariamente premere INVIO (non basta il clic con il mouse), assegnando così il nome \"firma\" all'immagine selezionata.\n • Si clicca sul pulsante \"RIPORTA FIRMA SUI MODULI\". Nel caso in cui potrebbero esserci delle vecchie firme sui moduli è bene eliminarle cliccando sul pulsante \"ELIMINA FIRMA SUI MODULI\""]
[]
[]
[]
[]
[]
[]
[null,"DATI GENERALI del CONDOMINIO"]
[null,"Condominio Palazzo Duck","Testo","Nome ufficiale del Condominio ( Agenzia delle Entrate)"]
[null,"Viale dei Platani 1","Testo","Indirizzo di Ubicazione del condominio"]
[null,"99999","Testo","C.A.P."]
[null,"PAPEROPOLI","Testo","Città"]
[null,"PP","Testo","Provincia"]
[null,"99999990799","Testo","Codice Fiscale del Condominio"]
[null,"palduck@ggggmail.com","Testo","Indirizzo e-mail del Condominio"]
[null,null,"Testo","Indirizzo pec del Condominio"]
[null,null,"Testo","Sito WEB"]
[null,"PalDuck","Testo","Codice del Condominio (attribuito dall'utilizzatore)","Max 12 caratteri"]
[null,"IT20J0760104400004010772334","Testo","IBAN del conto corrente condominiale"]
[null,"Condominio Palazzo Duck","Testo","Intestazione del conto corrente condominiale","Max 68 caratteri"]
[null,""]
[null,""]
[null,""]
[null,""]
[null,""]
[null,""]
[null,""]
[null,"DENOMINAZIONI DELLE TABELLE MILLESIMALI CONDOMINIALI DA UTILIZZARE NELLA RIPARTIZIONE DELLE SPESE"]
[null,"Proprietà","Testo","Tabella A  ","Max 24 caratteri"]
[null,"Scala","Testo","Tabella B  ","Max 24 caratteri"]
[null,"Ascensore","Testo","Tabella C   ","Max 24 caratteri"]
[null,"Abitazioni","Testo","Tabella D   ","Max 24 caratteri"]
[null,"Negozi","Testo","Tabella E   ","Max 24 caratteri"]
[null,null,"Testo","Tabella F   ","Max 24 caratteri"]
[null,null,"Testo","Tabella G   ","Max 24 caratteri"]
[null,null,"Testo","Tabella H   ","Max 24 caratteri"]
[null,null,"Testo","Tabella I   ","Max 24 caratteri"]
[null,null,"Testo","Tabella J ","Max 24 caratteri"]
[null,"DATA E MODALITÀ DI APPROVAZIONE DELLE TABELLE MILLESIMALI"]
[null,"2021-09-07","Data","Data di approvazione delle TABELLE MILLESIMALI"]
[null,"Delibera Assembleare","Testo","Modalità di approvazione delle tabelle"]
[null,""]
[null,""]
[null,""]
[null,""]
[null,""]
[null,""]
[null,"DATI CATASTALI UNITÀ IMMOBILIARE DI PROPRIETÀ CONDOMINIALE"]
[null,null,"Testo","Codice catastale Comune"]
[null,null,"Testo","Foglio"]
[null,null,"Testo","Particella"]
[null,null,"Testo","Sub"]
[null,null,"Testo","Zona"]
[null,null,"Testo","Categoria"]
[null,null,"Testo","Classe"]
[null,null,"Testo","Consistenza"]
[null,null,"Testo","Rendita"]
[null,null,"Testo","Indirizzo catastale"]
[null,null,"Testo","Piano"]
[]
[]
[]
[null,"CODICI IDENTIFICATIVI DELLE GESTIONI SPECIALI E DEI FONDI CHE SI DESIDERA INTEGRARE NELLA GESTIONE ORDINARIA "]
[null,"PROSPETTI","Testo","Denominazione Gestione Speciale e/o Fondo n. 1","Max 24 caratteri"]
[null,null,"Testo","Denominazione Gestione Speciale e/o Fondo n. 2","Max 24 caratteri"]
[null,null,"Testo","Denominazione Gestione Speciale e/o Fondo n. 3","Max 24 caratteri"]
[null,null,"Testo","Denominazione Gestione Speciale e/o Fondo n. 4","Max 24 caratteri"]
[null,null,"Testo","Denominazione Gestione Speciale e/o Fondo n. 5","Max 24 caratteri"]
[]
[]
[]
[]
[null,"DATI GENERALI DELL' ESERCIZIO CONTABILE"]
[null,2024,"Testo","Esercizio condominiale (o anno) gestito"]
[null,"01/01/2024-31/12/2024","Testo","Date inizio e fine esercizio"]
[]
[null,"20/05/2024","Testo","Data di approvazione del BILANCIO PREVENTIVO e PIANO DEI CONTI per l'Esercizio"]
[]
[]
[]
[]
[]
[null,"DATE DI SCADENZA DEI PAGAMENTI DELLE QUOTE E DELLE RATE",null,null,"TIPO DI RATA"]
[null,"2024-06-30","Data","Scadenza pagamento Conguaglio a debito per l'esercizio precedente"]
[null,"2024-01-10","Data","Scadenza pagamento 1a Rata ","TRIMESTRALE"]
[null,"2024-04-10","Data","Scadenza pagamento 2a Rata ","TRIMESTRALE"]
[null,"2024-06-10","Data","Scadenza pagamento 3a Rata","TRIMESTRALE"]
[null,"2024-10-10","Data","Scadenza pagamento 4a Rata","TRIMESTRALE"]
[null,null,"Data","Scadenza pagamento 5a Rata"]
[null,null,"Data","Scadenza pagamento 6a Rata"]
[null,null,"Data","Scadenza pagamento 7a Rata"]
[null,null,"Data","Scadenza pagamento 8a Rata"]
[null,null,"Data","Scadenza pagamento 9a Rata"]
[null,null,"Data","Scadenza pagamento 10a Rata"]
[null,null,"Data","Scadenza pagamento 11a Rata"]
[null,null,"Data","Scadenza pagamento 12a Rata"]
[]
[]
[]
[]
[]
[]
[null,"CRITERIO PER RESTITUZIONE AI CONDOMINI DEL CREDITO LORO DERIVANTE DALL' ESERCIZIO PRECEDENTE"]
[null,"2 - FRAZIONATO DALLA SECONDA RATA","Testo","1 - IL CREDITO È SCONTATO PER INTERO A PARTIRE DALLA PRIMA RATA\n2 - IL CREDITO È FRAZIONATO E SCONTATO DALLA SECONDA RATA"]
[null,""]
[null,""]
[null,""]
[null,"DILAZIONI NEL VERSAMENTO DELLE QUOTE APPROVATE E CONCESSE DALL' ASSEMBLEA "]
[null,90,"Numero","Numero di giorni di dilazione per pagamento rate"]
[null,30,"Numero","Numero di giorni di dilazione per pagamento conguagli"]
[]
[]
[null,"TESTI delle DICITURE per le INTESTAZIONI e PIÈ DI PAGINA dei fogli da stampare"]
[null,"Condominio \" PALAZZO DUCK  \"","Testo","Dicitura riportata nella Intestazione  dei fogli stampati ","Max. 60 caratteri"]
[null,"Condominio Pal. DUCK","Testo","Dicitura riportata nel Piè di Pagina dei fogli stampati ","Max. 25 caratteri"]
[]
[]
[null,"OPZIONI A SCELTA DEL'UTILIZZATORE NELLA CREAZIONE DEI FILE PDF DELLE COMUNICAZIONI"]
[null,0,"Testo","NUMERO DI FILE DA CREARE\n0 - per creare un file della comunicazione per ogni condomino.\n1 - per creare un unico file contenente la comunicazione per tutti i condomini."]
[null,0,"Testo","ELIMINAZIONE DEL FILE EXCEL DELLA COMUNICAZIONE\n0 - per eliminare il file EXCEL utilizzato per creare il PDF.\n1 - per mantenere  il file EXCEL utilizzato per creare il PDF."]
[null,"Tabella A  ","Testo","TABELLA DEI MILLESIMI DA RIPORTARE NEI DATI DEL DESTINATARIO DELLA COMUNICAZIONE\n[Nel caso di comunicazione generica, la comunicazione sarà redatta solo per i condomini che hanno millesimi diversi da zero nella tabella a fianco  indicata]"]
[null,1,"Testo","SCRITTURA DELLA DATA DI STAMPA SULLA COPERTINA FASCICOLI\n0 - per non riportare la data di stampa sulla copertina.\n1 - per riportare la data di stampa sulla copertina."]
[null,0,"Testo","FASCICOLO DEI CONDOMINI\n0 - stampa ad uso interno amministrazione (con dati di contatto per i singoli condomini).\n1 - stampa destinata ai condomini (senza dati di contatto per i singoli condomini)."]
[null,3,"Testo","FASCICOLO TABELLE MILLESIMALI\n1 - Stampa Tabelle Millesimali per Condomini.\n2 - Stampa Tabelle Millesimali per Unità Immobiliari e per Condomini.\n3 - Stampa Tabelle Millesimali per Unità Funzionali, per Unità Immobiliari e per Condomini."]
[null,0,"Testo","PAGINE INTERNE FASCICOLI\n0 - stampa pagine interne del fascicolo PDF in bianco e nero.\n1 - stampa pagine interne del fascicolo PDF a colori.\n"]
[null,0,"Testo","PROSPETTI DEI RIPARTI\n0 - stampe senza le colonne di suddivisione delle quote fra proprietario e inquilino\n1 - stampe con le colonne di suddivisione delle quote fra proprietario e inquilino"]
[null,1,"Testo","FASCICOLI BILANCIO PREVENTIVO E RENDICONTO\nIl prospetto dei riparti da inserire è\n0 - solo quello senza i millesimi\n1 - solo quello con i millesimi\n2 - entrambi"]
[null,""]

{"sheet":"iUF","index":2,"n_rows":110,"n_cols":13,"rows_kept":110,"cut":false,"hidden":true,"merged":[]}
[null,"È consentito variare i valori delle sole celle con sfondo bianco.\nI dati delle colonne con colore del testo rosso scuro devono essere necessariamente forniti.",null,null,null,null,null,null,null,null,null,null,0]
[null,"Per aggiungere ulteriori unità funzionali occorre scoprire le righe nascoste e scrivere i relativi dati. "]
[]
[]
[null,{"$f":"iDG!B32","v":"Condominio Palazzo Duck"}]
[]
[null,"UNITÀ FUNZIONALI"]
[]
[null,"CODICI IDENTIFICATIVI CONDOMINIALI",null,null,null,"UBICAZIONE REALE",null,null,null,null,null,"DESTINAZIONE"]
[null,"Unità\nFunzionale\nCondominiale","Unità\nImmobiliare\n cui appartiene","Condomino proprietario",null,"Odonimo","Civico","Edificio","Scala","Piano","Interno","Utilizzazione\nreale"]
[null,"UF01","U05","C05","Viale dei Platani","Viale dei Platani",1,"D","D",-1,null,"Cantina"]
[null,"UF02","U06","C05","Viale dei Platani","Viale dei Platani",1,"D","D",-1,null,"Cantina"]
[null,"UF03","U07","C06","Viale dei Platani","Viale dei Platani",1,"D","D",-1,null,"Cantina"]
[null,"UF04","U07","C06","Viale dei Platani","Viale dei Platani",1,"D","D",-1,null,"Cantina"]
[null,"UF05","U07","C06","Viale dei Platani","Viale dei Platani",1,"D","D",-1,null,"Autoclave"]
[null,"UF06","U07","C06","Viale dei Platani","Viale dei Platani",1,"D","D",-1,null,"Autoclave"]
[null,"UF07","U05","C05","Viale dei Platani","Viale dei Platani",1,"D","D",-1,null,"Autoclave"]
[null,"UF08","U06","C05","Viale dei Platani","Viale dei Platani",1,"D","D",-1,null,"Autoclave"]
[null,"UF09","U08","C06","Via degli Alberi di Pesco","Via degli Alberi di Pesco","3D","D","D",-1,null,"Garage"]
[null,"UF10","U09","C05","Via degli Alberi di Pesco","Via degli Alberi di Pesco","3D","D","D",-1,null,"Garage"]
[null,"UF11","U01","C01","Via degli Alberi di Ciliegio","Via degli Alberi di Ciliegio",90,"D","D",0,null,"Negozio"]
[null,"UF12","U02","C02","Via degli Alberi di Ciliegio","Via degli Alberi di Ciliegio",92,"D","D",0,null,"Negozio"]
[null,"UF13","U03","C03","Via degli Alberi di Ciliegio","Via degli Alberi di Ciliegio",94,"D","D",0,null,"Negozio"]
[null,"UF14","U04","C04","Via degli Alberi di Ciliegio","Via degli Alberi di Ciliegio",96,"D","D",0,null,"Negozio"]
[null,"UF15","U07","C06","Viale dei Platani","Viale dei Platani",1,"D","D",0,null,"Ripostiglio"]
[null,"UF16","U05","C05","Viale dei Platani","Viale dei Platani",1,"D","D",0,null,"Ripostiglio"]
[null,"UF17","U05","C05","Viale dei Platani","Viale dei Platani",1,"D","D",1,null,"Abitazione"]
[null,"UF18","U06","C05","Viale dei Platani","Viale dei Platani",1,"D","D",1,null,"Abitazione"]
[null,"UF19","U07","C06","Viale dei Platani","Viale dei Platani",1,"D","D",2,null,"Abitazione"]
[null,"UF20","U07","C06","Viale dei Platani","Viale dei Platani",1,"D","D",3,null,"Mansarda"]
[null,"UF21","U07","C06","Viale dei Platani","Viale dei Platani",1,"D","D",-1,null,"Sottoscala"]
[null,"UF22"]
[null,"UF23"]
[null,"UF24"]
[null,"UF25"]
[null,"UF26"]
[null,"UF27"]
[null,"UF28"]
[null,"UF29"]
[null,"UF30"]
[null,"UF31"]
[null,"UF32"]
[null,"UF33"]
[null,"UF34"]
[null,"UF35"]
[null,"UF36"]
[null,"UF37"]
[null,"UF38"]
[null,"UF39"]
[null,"UF40"]
[null,"UF41"]
[null,"UF42"]
[null,"UF43"]
[null,"UF44"]
[null,"UF45"]
[null,"UF46"]
[null,"UF47"]
[null,"UF48"]
[null,"UF49"]
[null,"UF50"]
[null,"UF51"]
[null,"UF52"]
[null,"UF53"]
[null,"UF54"]
[null,"UF55"]
[null,"UF56"]
[null,"UF57"]
[null,"UF58"]
[null,"UF59"]
[null,"UF60"]
[null,"UF61"]
[null,"UF62"]
[null,"UF63"]
[null,"UF64"]
[null,"UF65"]
[null,"UF66"]
[null,"UF67"]
[null,"UF68"]
[null,"UF69"]
[null,"UF70"]
[null,"UF71"]
[null,"UF72"]
[null,"UF73"]
[null,"UF74"]
[null,"UF75"]
[null,"UF76"]
[null,"UF77"]
[null,"UF78"]
[null,"UF79"]
[null,"UF80"]
[null,"UF81"]
[null,"UF82"]
[null,"UF83"]
[null,"UF84"]
[null,"UF85"]
[null,"UF86"]
[null,"UF87"]
[null,"UF88"]
[null,"UF89"]
[null,"UF90"]
[null,"UF91"]
[null,"UF92"]
[null,"UF93"]
[null,"UF94"]
[null,"UF95"]
[null,"UF96"]
[null,"UF97"]
[null,"UF98"]
[null,"UF99"]
[0,null,null,null,null,null,null,null,null,null,null,null,0]

{"sheet":"iUI","index":3,"n_rows":110,"n_cols":24,"rows_kept":110,"cut":false,"hidden":true,"merged":[]}
[null,"È consentito variare i valori delle sole celle con sfondo bianco."]
[null,"I dati delle colonne con colore del testo rosso scuro devono essere necessariamente forniti."]
[null,"Per aggiungere ulteriori unità catastali occorre scoprire le righe nascoste e scrivere i relativi dati. "]
[]
[null,{"$f":"iDG!B32","v":"Condominio Palazzo Duck"}]
[]
[null,"UNITÀ IMMOBILIARI o CATASTALI"]
[]
[null,"CODICI IDENTIFICATIVI\nCONDOMINIALI",null,null,null,"PROPRIETÀ","IDENTIFICATIVI CATASTALI",null,null,null,null,null,null,null,null,null,"UBICAZIONE CATASTALE",null,null,null,null,null,null,"DESTINAZIONE\nCATASTALE"]
[null,"Unità Immobiliare\no Catastale\n","Unità\nFunzionali\ncostituenti","Condomino\nProprietario",null,"Condomino","Codice Catastale\nComune","Foglio","Particella","Subalterno","Zona Censuaria","Categoria","Classe","Consistenza\n(vani)","Consistenza\n(mq)","Rendita\n(euro)","Comune","Odonimo","Civico","Edificio","Scala","Piano","Interno","Utilizzazione\nCatastale"]
[null,"U01","UF11",{"$f":"IF(G11<>\"\",IFERROR(VLOOKUP(B11,iUF!$C$11:$D$109,2,FALSE),\"\"),\"\")","v":"C01"},null,{"$f":"IF(D11<>\"\",IFERROR(VLOOKUP(D11,iCONDOMINI!$B$11:$C$109,2,FALSE),\"\"),\"\")","v":"Paperoga"},"C999",77,121,2,1,"C/1","2",null,43,872.76,"PAPEROPOLI","Via degli Alberi Di Ciliegio",122,null,null,"PT",null,"NEGOZIO"]
[null,"U02","UF12",{"$f":"IF(G12<>\"\",IFERROR(VLOOKUP(B12,iUF!$C$11:$D$109,2,FALSE),\"\"),\"\")","v":"C02"},null,{"$f":"IF(D12<>\"\",IFERROR(VLOOKUP(D12,iCONDOMINI!$B$11:$C$109,2,FALSE),\"\"),\"\")","v":"Ciccio"},"C999",77,121,3,1,"C/1","2",null,30,608.9,"PAPEROPOLI","Via degli Alberi Di Ciliegio",120,null,null,"PT",null,"NEGOZIO"]
[null,"U03","UF13",{"$f":"IF(G13<>\"\",IFERROR(VLOOKUP(B13,iUF!$C$11:$D$109,2,FALSE),\"\"),\"\")","v":"C03"},81.520004272460938,{"$f":"IF(D13<>\"\",IFERROR(VLOOKUP(D13,iCONDOMINI!$B$11:$C$109,2,FALSE),\"\"),\"\")","v":"Gastone"},"C999",77,121,4,1,"C/1","2",null,60,1217.81,"PAPEROPOLI","Via degli Alberi Di Ciliegio",118,null,null,"PT",null,"NEGOZIO"]
[null,"U04","UF14",{"$f":"IF(G14<>\"\",IFERROR(VLOOKUP(B14,iUF!$C$11:$D$109,2,FALSE),\"\"),\"\")","v":"C04"},null,{"$f":"IF(D14<>\"\",IFERROR(VLOOKUP(D14,iCONDOMINI!$B$11:$C$109,2,FALSE),\"\"),\"\")","v":"I tre nipotini"},"C999",77,121,5,1,"C/1","3",null,81,1915.95,"PAPEROPOLI","Via degli Alberi Di Ciliegio",116,null,null,"PT",null,"NEGOZIO"]
[null,"U05","UF01+UF07+UF16+UF17",{"$f":"IF(G15<>\"\",IFERROR(VLOOKUP(B15,iUF!$C$11:$D$109,2,FALSE),\"\"),\"\")","v":"C05"},null,{"$f":"IF(D15<>\"\",IFERROR(VLOOKUP(D15,iCONDOMINI!$B$11:$C$109,2,FALSE),\"\"),\"\")","v":"Nonna Papera"},"C999",77,121,6,1,"A/2","2","7,5",null,619.75,"PAPEROPOLI","Viale dei Platani","1",null,null,"P1",1,"APPARTAMENTO"]
[null,"U06","UF02+UF08+UF18",{"$f":"IF(G16<>\"\",IFERROR(VLOOKUP(B16,iUF!$C$11:$D$109,2,FALSE),\"\"),\"\")","v":"C05"},null,{"$f":"IF(D16<>\"\",IFERROR(VLOOKUP(D16,iCONDOMINI!$B$11:$C$109,2,FALSE),\"\"),\"\")","v":"Nonna Papera"},"C999",77,121,7,1,"A/2","2","6",null,495.8,"PAPEROPOLI","Viale dei Platani","1",null,null,"P1",2,"APPARTAMENTO"]
[null,"U07","UF03+UF04+UF05+UF06+UF15+\nUF19+UF20+UF21",{"$f":"IF(G17<>\"\",IFERROR(VLOOKUP(B17,iUF!$C$11:$D$109,2,FALSE),\"\"),\"\")","v":"C06"},null,{"$f":"IF(D17<>\"\",IFERROR(VLOOKUP(D17,iCONDOMINI!$B$11:$C$109,2,FALSE),\"\"),\"\")","v":"Fidanzati Paperino-Paperina"},"C999",77,121,8,1,"A/2","3","14,5",null,1422.84,"PAPEROPOLI","Viale dei Platani","1",null,null,"P2",3,"APPARTAMENTO"]
[null,"U08","UF09",{"$f":"IF(G18<>\"\",IFERROR(VLOOKUP(B18,iUF!$C$11:$D$109,2,FALSE),\"\"),\"\")","v":"C06"},null,{"$f":"IF(D18<>\"\",IFERROR(VLOOKUP(D18,iCONDOMINI!$B$11:$C$109,2,FALSE),\"\"),\"\")","v":"Fidanzati Paperino-Paperina"},"C999",77,121,9,1,"C/6","4",null,43,99.93,"PAPEROPOLI","Via degli Alberi di Pesco","3A",null,null,"S1",null,"GARAGE"]
[null,"U09","UF10",{"$f":"IF(G19<>\"\",IFERROR(VLOOKUP(B19,iUF!$C$11:$D$109,2,FALSE),\"\"),\"\")","v":"C05"},null,{"$f":"IF(D19<>\"\",IFERROR(VLOOKUP(D19,iCONDOMINI!$B$11:$C$109,2,FALSE),\"\"),\"\")","v":"Nonna Papera"},"C999",77,121,10,1,"C/6","4",null,45,104.58,"PAPEROPOLI","Via degli Alberi di Pesco","3A",null,null,"S1",null,"GARAGE"]
[null,"U10",null,{"$f":"IF(G20<>\"\",IFERROR(VLOOKUP(B20,iUF!$C$11:$D$109,2,FALSE),\"\"),\"\")","v":""},null,{"$f":"IF(D20<>\"\",IFERROR(VLOOKUP(D20,iCONDOMINI!$B$11:$C$109,2,FALSE),\"\"),\"\")","v":""}]
[null,"U11",null,{"$f":"IF(G21<>\"\",IFERROR(VLOOKUP(B21,iUF!$C$11:$D$109,2,FALSE),\"\"),\"\")","v":""},null,{"$f":"IF(D21<>\"\",IFERROR(VLOOKUP(D21,iCONDOMINI!$B$11:$C$109,2,FALSE),\"\"),\"\")","v":""}]
[null,"U12",null,{"$f":"IF(G22<>\"\",IFERROR(VLOOKUP(B22,iUF!$C$11:$D$109,2,FALSE),\"\"),\"\")","v":""},null,{"$f":"IF(D22<>\"\",IFERROR(VLOOKUP(D22,iCONDOMINI!$B$11:$C$109,2,FALSE),\"\"),\"\")","v":""}]
[null,"U13",null,{"$f":"IF(G23<>\"\",IFERROR(VLOOKUP(B23,iUF!$C$11:$D$109,2,FALSE),\"\"),\"\")","v":""},null,{"$f":"IF(D23<>\"\",IFERROR(VLOOKUP(D23,iCONDOMINI!$B$11:$C$109,2,FALSE),\"\"),\"\")","v":""}]
[null,"U14",null,{"$f":"IF(G24<>\"\",IFERROR(VLOOKUP(B24,iUF!$C$11:$D$109,2,FALSE),\"\"),\"\")","v":""},null,{"$f":"IF(D24<>\"\",IFERROR(VLOOKUP(D24,iCONDOMINI!$B$11:$C$109,2,FALSE),\"\"),\"\")","v":""}]
[null,"U15",null,{"$f":"IF(G25<>\"\",IFERROR(VLOOKUP(B25,iUF!$C$11:$D$109,2,FALSE),\"\"),\"\")","v":""},null,{"$f":"IF(D25<>\"\",IFERROR(VLOOKUP(D25,iCONDOMINI!$B$11:$C$109,2,FALSE),\"\"),\"\")","v":""}]
[null,"U16",null,{"$f":"IF(G26<>\"\",IFERROR(VLOOKUP(B26,iUF!$C$11:$D$109,2,FALSE),\"\"),\"\")","v":""},null,{"$f":"IF(D26<>\"\",IFERROR(VLOOKUP(D26,iCONDOMINI!$B$11:$C$109,2,FALSE),\"\"),\"\")","v":""}]
[null,"U17",null,{"$f":"IF(G27<>\"\",IFERROR(VLOOKUP(B27,iUF!$C$11:$D$109,2,FALSE),\"\"),\"\")","v":""},null,{"$f":"IF(D27<>\"\",IFERROR(VLOOKUP(D27,iCONDOMINI!$B$11:$C$109,2,FALSE),\"\"),\"\")","v":""}]
[null,"U18",null,{"$f":"IF(G28<>\"\",IFERROR(VLOOKUP(B28,iUF!$C$11:$D$109,2,FALSE),\"\"),\"\")","v":""},null,{"$f":"IF(D28<>\"\",IFERROR(VLOOKUP(D28,iCONDOMINI!$B$11:$C$109,2,FALSE),\"\"),\"\")","v":""}]
[null,"U19",null,{"$f":"IF(G29<>\"\",IFERROR(VLOOKUP(B29,iUF!$C$11:$D$109,2,FALSE),\"\"),\"\")","v":""},null,{"$f":"IF(D29<>\"\",IFERROR(VLOOKUP(D29,iCONDOMINI!$B$11:$C$109,2,FALSE),\"\"),\"\")","v":""}]
[null,"U20",null,{"$f":"IF(G30<>\"\",IFERROR(VLOOKUP(B30,iUF!$C$11:$D$109,2,FALSE),\"\"),\"\")","v":""},null,{"$f":"IF(D30<>\"\",IFERROR(VLOOKUP(D30,iCONDOMINI!$B$11:$C$109,2,FALSE),\"\"),\"\")","v":""}]
[null,"U21",null,{"$f":"IF(G31<>\"\",IFERROR(VLOOKUP(B31,iUF!$C$11:$D$109,2,FALSE),\"\"),\"\")","v":""},null,{"$f":"IF(D31<>\"\",IFERROR(VLOOKUP(D31,iCONDOMINI!$B$11:$C$109,2,FALSE),\"\"),\"\")","v":""}]
[null,"U22",null,{"$f":"IF(G32<>\"\",IFERROR(VLOOKUP(B32,iUF!$C$11:$D$109,2,FALSE),\"\"),\"\")","v":""},null,{"$f":"IF(D32<>\"\",IFERROR(VLOOKUP(D32,iCONDOMINI!$B$11:$C$109,2,FALSE),\"\"),\"\")","v":""}]
[null,"U23",null,{"$f":"IF(G33<>\"\",IFERROR(VLOOKUP(B33,iUF!$C$11:$D$109,2,FALSE),\"\"),\"\")","v":""},null,{"$f":"IF(D33<>\"\",IFERROR(VLOOKUP(D33,iCONDOMINI!$B$11:$C$109,2,FALSE),\"\"),\"\")","v":""}]
[null,"U24",null,{"$f":"IF(G34<>\"\",IFERROR(VLOOKUP(B34,iUF!$C$11:$D$109,2,FALSE),\"\"),\"\")","v":""},null,{"$f":"IF(D34<>\"\",IFERROR(VLOOKUP(D34,iCONDOMINI!$B$11:$C$109,2,FALSE),\"\"),\"\")","v":""}]
[null,"U25",null,{"$f":"IF(G35<>\"\",IFERROR(VLOOKUP(B35,iUF!$C$11:$D$109,2,FALSE),\"\"),\"\")","v":""},null,{"$f":"IF(D35<>\"\",IFERROR(VLOOKUP(D35,iCONDOMINI!$B$11:$C$109,2,FALSE),\"\"),\"\")","v":""}]
[null,"U26",null,{"$f":"IF(G36<>\"\",IFERROR(VLOOKUP(B36,iUF!$C$11:$D$109,2,FALSE),\"\"),\"\")","v":""},null,{"$f":"IF(D36<>\"\",IFERROR(VLOOKUP(D36,iCONDOMINI!$B$11:$C$109,2,FALSE),\"\"),\"\")","v":""}]
[null,"U27",null,{"$f":"IF(G37<>\"\",IFERROR(VLOOKUP(B37,iUF!$C$11:$D$109,2,FALSE),\"\"),\"\")","v":""},null,{"$f":"IF(D37<>\"\",IFERROR(VLOOKUP(D37,iCONDOMINI!$B$11:$C$109,2,FALSE),\"\"),\"\")","v":""}]
[null,"U28",null,{"$f":"IF(G38<>\"\",IFERROR(VLOOKUP(B38,iUF!$C$11:$D$109,2,FALSE),\"\"),\"\")","v":""},null,{"$f":"IF(D38<>\"\",IFERROR(VLOOKUP(D38,iCONDOMINI!$B$11:$C$109,2,FALSE),\"\"),\"\")","v":""}]
[null,"U29",null,{"$f":"IF(G39<>\"\",IFERROR(VLOOKUP(B39,iUF!$C$11:$D$109,2,FALSE),\"\"),\"\")","v":""},null,{"$f":"IF(D39<>\"\",IFERROR(VLOOKUP(D39,iCONDOMINI!$B$11:$C$109,2,FALSE),\"\"),\"\")","v":""}]
[null,"U30",null,{"$f":"IF(G40<>\"\",IFERROR(VLOOKUP(B40,iUF!$C$11:$D$109,2,FALSE),\"\"),\"\")","v":""},null,{"$f":"IF(D40<>\"\",IFERROR(VLOOKUP(D40,iCONDOMINI!$B$11:$C$109,2,FALSE),\"\"),\"\")","v":""}]
[null,"U31",null,{"$f":"IF(G41<>\"\",IFERROR(VLOOKUP(B41,iUF!$C$11:$D$109,2,FALSE),\"\"),\"\")","v":""},null,{"$f":"IF(D41<>\"\",IFERROR(VLOOKUP(D41,iCONDOMINI!$B$11:$C$109,2,FALSE),\"\"),\"\")","v":""}]
[null,"U32",null,{"$f":"IF(G42<>\"\",IFERROR(VLOOKUP(B42,iUF!$C$11:$D$109,2,FALSE),\"\"),\"\")","v":""},null,{"$f":"IF(D42<>\"\",IFERROR(VLOOKUP(D42,iCONDOMINI!$B$11:$C$109,2,FALSE),\"\"),\"\")","v":""}]
[null,"U33",null,{"$f":"IF(G43<>\"\",IFERROR(VLOOKUP(B43,iUF!$C$11:$D$109,2,FALSE),\"\"),\"\")","v":""},null,{"$f":"IF(D43<>\"\",IFERROR(VLOOKUP(D43,iCONDOMINI!$B$11:$C$109,2,FALSE),\"\"),\"\")","v":""}]
[null,"U34",null,{"$f":"IF(G44<>\"\",IFERROR(VLOOKUP(B44,iUF!$C$11:$D$109,2,FALSE),\"\"),\"\")","v":""},null,{"$f":"IF(D44<>\"\",IFERROR(VLOOKUP(D44,iCONDOMINI!$B$11:$C$109,2,FALSE),\"\"),\"\")","v":""}]
[null,"U35",null,{"$f":"IF(G45<>\"\",IFERROR(VLOOKUP(B45,iUF!$C$11:$D$109,2,FALSE),\"\"),\"\")","v":""},null,{"$f":"IF(D45<>\"\",IFERROR(VLOOKUP(D45,iCONDOMINI!$B$11:$C$109,2,FALSE),\"\"),\"\")","v":""}]
[null,"U36",null,{"$f":"IF(G46<>\"\",IFERROR(VLOOKUP(B46,iUF!$C$11:$D$109,2,FALSE),\"\"),\"\")","v":""},null,{"$f":"IF(D46<>\"\",IFERROR(VLOOKUP(D46,iCONDOMINI!$B$11:$C$109,2,FALSE),\"\"),\"\")","v":""}]
[null,"U37",null,{"$f":"IF(G47<>\"\",IFERROR(VLOOKUP(B47,iUF!$C$11:$D$109,2,FALSE),\"\"),\"\")","v":""},null,{"$f":"IF(D47<>\"\",IFERROR(VLOOKUP(D47,iCONDOMINI!$B$11:$C$109,2,FALSE),\"\"),\"\")","v":""}]
[null,"U38",null,{"$f":"IF(G48<>\"\",IFERROR(VLOOKUP(B48,iUF!$C$11:$D$109,2,FALSE),\"\"),\"\")","v":""},null,{"$f":"IF(D48<>\"\",IFERROR(VLOOKUP(D48,iCONDOMINI!$B$11:$C$109,2,FALSE),\"\"),\"\")","v":""}]
[null,"U39",null,{"$f":"IF(G49<>\"\",IFERROR(VLOOKUP(B49,iUF!$C$11:$D$109,2,FALSE),\"\"),\"\")","v":""},null,{"$f":"IF(D49<>\"\",IFERROR(VLOOKUP(D49,iCONDOMINI!$B$11:$C$109,2,FALSE),\"\"),\"\")","v":""}]
[null,"U40",null,{"$f":"IF(G50<>\"\",IFERROR(VLOOKUP(B50,iUF!$C$11:$D$109,2,FALSE),\"\"),\"\")","v":""},null,{"$f":"IF(D50<>\"\",IFERROR(VLOOKUP(D50,iCONDOMINI!$B$11:$C$109,2,FALSE),\"\"),\"\")","v":""}]
[null,"U41",null,{"$f":"IF(G51<>\"\",IFERROR(VLOOKUP(B51,iUF!$C$11:$D$109,2,FALSE),\"\"),\"\")","v":""},null,{"$f":"IF(D51<>\"\",IFERROR(VLOOKUP(D51,iCONDOMINI!$B$11:$C$109,2,FALSE),\"\"),\"\")","v":""}]
[null,"U42",null,{"$f":"IF(G52<>\"\",IFERROR(VLOOKUP(B52,iUF!$C$11:$D$109,2,FALSE),\"\"),\"\")","v":""},null,{"$f":"IF(D52<>\"\",IFERROR(VLOOKUP(D52,iCONDOMINI!$B$11:$C$109,2,FALSE),\"\"),\"\")","v":""}]
[null,"U43",null,{"$f":"IF(G53<>\"\",IFERROR(VLOOKUP(B53,iUF!$C$11:$D$109,2,FALSE),\"\"),\"\")","v":""},null,{"$f":"IF(D53<>\"\",IFERROR(VLOOKUP(D53,iCONDOMINI!$B$11:$C$109,2,FALSE),\"\"),\"\")","v":""}]
[null,"U44",null,{"$f":"IF(G54<>\"\",IFERROR(VLOOKUP(B54,iUF!$C$11:$D$109,2,FALSE),\"\"),\"\")","v":""},null,{"$f":"IF(D54<>\"\",IFERROR(VLOOKUP(D54,iCONDOMINI!$B$11:$C$109,2,FALSE),\"\"),\"\")","v":""}]
[null,"U45",null,{"$f":"IF(G55<>\"\",IFERROR(VLOOKUP(B55,iUF!$C$11:$D$109,2,FALSE),\"\"),\"\")","v":""},null,{"$f":"IF(D55<>\"\",IFERROR(VLOOKUP(D55,iCONDOMINI!$B$11:$C$109,2,FALSE),\"\"),\"\")","v":""}]
[null,"U46",null,{"$f":"IF(G56<>\"\",IFERROR(VLOOKUP(B56,iUF!$C$11:$D$109,2,FALSE),\"\"),\"\")","v":""},null,{"$f":"IF(D56<>\"\",IFERROR(VLOOKUP(D56,iCONDOMINI!$B$11:$C$109,2,FALSE),\"\"),\"\")","v":""}]
[null,"U47",null,{"$f":"IF(G57<>\"\",IFERROR(VLOOKUP(B57,iUF!$C$11:$D$109,2,FALSE),\"\"),\"\")","v":""},null,{"$f":"IF(D57<>\"\",IFERROR(VLOOKUP(D57,iCONDOMINI!$B$11:$C$109,2,FALSE),\"\"),\"\")","v":""}]
[null,"U48",null,{"$f":"IF(G58<>\"\",IFERROR(VLOOKUP(B58,iUF!$C$11:$D$109,2,FALSE),\"\"),\"\")","v":""},null,{"$f":"IF(D58<>\"\",IFERROR(VLOOKUP(D58,iCONDOMINI!$B$11:$C$109,2,FALSE),\"\"),\"\")","v":""}]
[null,"U49",null,{"$f":"IF(G59<>\"\",IFERROR(VLOOKUP(B59,iUF!$C$11:$D$109,2,FALSE),\"\"),\"\")","v":""},null,{"$f":"IF(D59<>\"\",IFERROR(VLOOKUP(D59,iCONDOMINI!$B$11:$C$109,2,FALSE),\"\"),\"\")","v":""}]
[null,"U50",null,{"$f":"IF(G60<>\"\",IFERROR(VLOOKUP(B60,iUF!$C$11:$D$109,2,FALSE),\"\"),\"\")","v":""},null,{"$f":"IF(D60<>\"\",IFERROR(VLOOKUP(D60,iCONDOMINI!$B$11:$C$109,2,FALSE),\"\"),\"\")","v":""}]
[null,"U51",null,{"$f":"IF(G61<>\"\",IFERROR(VLOOKUP(B61,iUF!$C$11:$D$109,2,FALSE),\"\"),\"\")","v":""},null,{"$f":"IF(D61<>\"\",IFERROR(VLOOKUP(D61,iCONDOMINI!$B$11:$C$109,2,FALSE),\"\"),\"\")","v":""}]
[null,"U52",null,{"$f":"IF(G62<>\"\",IFERROR(VLOOKUP(B62,iUF!$C$11:$D$109,2,FALSE),\"\"),\"\")","v":""},null,{"$f":"IF(D62<>\"\",IFERROR(VLOOKUP(D62,iCONDOMINI!$B$11:$C$109,2,FALSE),\"\"),\"\")","v":""}]
[null,"U53",null,{"$f":"IF(G63<>\"\",IFERROR(VLOOKUP(B63,iUF!$C$11:$D$109,2,FALSE),\"\"),\"\")","v":""},null,{"$f":"IF(D63<>\"\",IFERROR(VLOOKUP(D63,iCONDOMINI!$B$11:$C$109,2,FALSE),\"\"),\"\")","v":""}]
[null,"U54",null,{"$f":"IF(G64<>\"\",IFERROR(VLOOKUP(B64,iUF!$C$11:$D$109,2,FALSE),\"\"),\"\")","v":""},null,{"$f":"IF(D64<>\"\",IFERROR(VLOOKUP(D64,iCONDOMINI!$B$11:$C$109,2,FALSE),\"\"),\"\")","v":""}]
[null,"U55",null,{"$f":"IF(G65<>\"\",IFERROR(VLOOKUP(B65,iUF!$C$11:$D$109,2,FALSE),\"\"),\"\")","v":""},null,{"$f":"IF(D65<>\"\",IFERROR(VLOOKUP(D65,iCONDOMINI!$B$11:$C$109,2,FALSE),\"\"),\"\")","v":""}]
[null,"U56",null,{"$f":"IF(G66<>\"\",IFERROR(VLOOKUP(B66,iUF!$C$11:$D$109,2,FALSE),\"\"),\"\")","v":""},null,{"$f":"IF(D66<>\"\",IFERROR(VLOOKUP(D66,iCONDOMINI!$B$11:$C$109,2,FALSE),\"\"),\"\")","v":""}]
[null,"U57",null,{"$f":"IF(G67<>\"\",IFERROR(VLOOKUP(B67,iUF!$C$11:$D$109,2,FALSE),\"\"),\"\")","v":""},null,{"$f":"IF(D67<>\"\",IFERROR(VLOOKUP(D67,iCONDOMINI!$B$11:$C$109,2,FALSE),\"\"),\"\")","v":""}]
[null,"U58",null,{"$f":"IF(G68<>\"\",IFERROR(VLOOKUP(B68,iUF!$C$11:$D$109,2,FALSE),\"\"),\"\")","v":""},null,{"$f":"IF(D68<>\"\",IFERROR(VLOOKUP(D68,iCONDOMINI!$B$11:$C$109,2,FALSE),\"\"),\"\")","v":""}]
[null,"U59",null,{"$f":"IF(G69<>\"\",IFERROR(VLOOKUP(B69,iUF!$C$11:$D$109,2,FALSE),\"\"),\"\")","v":""},null,{"$f":"IF(D69<>\"\",IFERROR(VLOOKUP(D69,iCONDOMINI!$B$11:$C$109,2,FALSE),\"\"),\"\")","v":""}]
[null,"U60",null,{"$f":"IF(G70<>\"\",IFERROR(VLOOKUP(B70,iUF!$C$11:$D$109,2,FALSE),\"\"),\"\")","v":""},null,{"$f":"IF(D70<>\"\",IFERROR(VLOOKUP(D70,iCONDOMINI!$B$11:$C$109,2,FALSE),\"\"),\"\")","v":""}]
[null,"U61",null,{"$f":"IF(G71<>\"\",IFERROR(VLOOKUP(B71,iUF!$C$11:$D$109,2,FALSE),\"\"),\"\")","v":""},null,{"$f":"IF(D71<>\"\",IFERROR(VLOOKUP(D71,iCONDOMINI!$B$11:$C$109,2,FALSE),\"\"),\"\")","v":""}]
[null,"U62",null,{"$f":"IF(G72<>\"\",IFERROR(VLOOKUP(B72,iUF!$C$11:$D$109,2,FALSE),\"\"),\"\")","v":""},null,{"$f":"IF(D72<>\"\",IFERROR(VLOOKUP(D72,iCONDOMINI!$B$11:$C$109,2,FALSE),\"\"),\"\")","v":""}]
[null,"U63",null,{"$f":"IF(G73<>\"\",IFERROR(VLOOKUP(B73,iUF!$C$11:$D$109,2,FALSE),\"\"),\"\")","v":""},null,{"$f":"IF(D73<>\"\",IFERROR(VLOOKUP(D73,iCONDOMINI!$B$11:$C$109,2,FALSE),\"\"),\"\")","v":""}]
[null,"U64",null,{"$f":"IF(G74<>\"\",IFERROR(VLOOKUP(B74,iUF!$C$11:$D$109,2,FALSE),\"\"),\"\")","v":""},null,{"$f":"IF(D74<>\"\",IFERROR(VLOOKUP(D74,iCONDOMINI!$B$11:$C$109,2,FALSE),\"\"),\"\")","v":""}]
[null,"U65",null,{"$f":"IF(G75<>\"\",IFERROR(VLOOKUP(B75,iUF!$C$11:$D$109,2,FALSE),\"\"),\"\")","v":""},null,{"$f":"IF(D75<>\"\",IFERROR(VLOOKUP(D75,iCONDOMINI!$B$11:$C$109,2,FALSE),\"\"),\"\")","v":""}]
[null,"U66",null,{"$f":"IF(G76<>\"\",IFERROR(VLOOKUP(B76,iUF!$C$11:$D$109,2,FALSE),\"\"),\"\")","v":""},null,{"$f":"IF(D76<>\"\",IFERROR(VLOOKUP(D76,iCONDOMINI!$B$11:$C$109,2,FALSE),\"\"),\"\")","v":""}]
[null,"U67",null,{"$f":"IF(G77<>\"\",IFERROR(VLOOKUP(B77,iUF!$C$11:$D$109,2,FALSE),\"\"),\"\")","v":""},null,{"$f":"IF(D77<>\"\",IFERROR(VLOOKUP(D77,iCONDOMINI!$B$11:$C$109,2,FALSE),\"\"),\"\")","v":""}]
[null,"U68",null,{"$f":"IF(G78<>\"\",IFERROR(VLOOKUP(B78,iUF!$C$11:$D$109,2,FALSE),\"\"),\"\")","v":""},null,{"$f":"IF(D78<>\"\",IFERROR(VLOOKUP(D78,iCONDOMINI!$B$11:$C$109,2,FALSE),\"\"),\"\")","v":""}]
[null,"U69",null,{"$f":"IF(G79<>\"\",IFERROR(VLOOKUP(B79,iUF!$C$11:$D$109,2,FALSE),\"\"),\"\")","v":""},null,{"$f":"IF(D79<>\"\",IFERROR(VLOOKUP(D79,iCONDOMINI!$B$11:$C$109,2,FALSE),\"\"),\"\")","v":""}]
[null,"U70",null,{"$f":"IF(G80<>\"\",IFERROR(VLOOKUP(B80,iUF!$C$11:$D$109,2,FALSE),\"\"),\"\")","v":""},null,{"$f":"IF(D80<>\"\",IFERROR(VLOOKUP(D80,iCONDOMINI!$B$11:$C$109,2,FALSE),\"\"),\"\")","v":""}]
[null,"U71",null,{"$f":"IF(G81<>\"\",IFERROR(VLOOKUP(B81,iUF!$C$11:$D$109,2,FALSE),\"\"),\"\")","v":""},null,{"$f":"IF(D81<>\"\",IFERROR(VLOOKUP(D81,iCONDOMINI!$B$11:$C$109,2,FALSE),\"\"),\"\")","v":""}]
[null,"U72",null,{"$f":"IF(G82<>\"\",IFERROR(VLOOKUP(B82,iUF!$C$11:$D$109,2,FALSE),\"\"),\"\")","v":""},null,{"$f":"IF(D82<>\"\",IFERROR(VLOOKUP(D82,iCONDOMINI!$B$11:$C$109,2,FALSE),\"\"),\"\")","v":""}]
[null,"U73",null,{"$f":"IF(G83<>\"\",IFERROR(VLOOKUP(B83,iUF!$C$11:$D$109,2,FALSE),\"\"),\"\")","v":""},null,{"$f":"IF(D83<>\"\",IFERROR(VLOOKUP(D83,iCONDOMINI!$B$11:$C$109,2,FALSE),\"\"),\"\")","v":""}]
[null,"U74",null,{"$f":"IF(G84<>\"\",IFERROR(VLOOKUP(B84,iUF!$C$11:$D$109,2,FALSE),\"\"),\"\")","v":""},null,{"$f":"IF(D84<>\"\",IFERROR(VLOOKUP(D84,iCONDOMINI!$B$11:$C$109,2,FALSE),\"\"),\"\")","v":""}]
[null,"U75",null,{"$f":"IF(G85<>\"\",IFERROR(VLOOKUP(B85,iUF!$C$11:$D$109,2,FALSE),\"\"),\"\")","v":""},null,{"$f":"IF(D85<>\"\",IFERROR(VLOOKUP(D85,iCONDOMINI!$B$11:$C$109,2,FALSE),\"\"),\"\")","v":""}]
[null,"U76",null,{"$f":"IF(G86<>\"\",IFERROR(VLOOKUP(B86,iUF!$C$11:$D$109,2,FALSE),\"\"),\"\")","v":""},null,{"$f":"IF(D86<>\"\",IFERROR(VLOOKUP(D86,iCONDOMINI!$B$11:$C$109,2,FALSE),\"\"),\"\")","v":""}]
[null,"U77",null,{"$f":"IF(G87<>\"\",IFERROR(VLOOKUP(B87,iUF!$C$11:$D$109,2,FALSE),\"\"),\"\")","v":""},null,{"$f":"IF(D87<>\"\",IFERROR(VLOOKUP(D87,iCONDOMINI!$B$11:$C$109,2,FALSE),\"\"),\"\")","v":""}]
[null,"U78",null,{"$f":"IF(G88<>\"\",IFERROR(VLOOKUP(B88,iUF!$C$11:$D$109,2,FALSE),\"\"),\"\")","v":""},null,{"$f":"IF(D88<>\"\",IFERROR(VLOOKUP(D88,iCONDOMINI!$B$11:$C$109,2,FALSE),\"\"),\"\")","v":""}]
[null,"U79",null,{"$f":"IF(G89<>\"\",IFERROR(VLOOKUP(B89,iUF!$C$11:$D$109,2,FALSE),\"\"),\"\")","v":""},null,{"$f":"IF(D89<>\"\",IFERROR(VLOOKUP(D89,iCONDOMINI!$B$11:$C$109,2,FALSE),\"\"),\"\")","v":""}]
[null,"U80",null,{"$f":"IF(G90<>\"\",IFERROR(VLOOKUP(B90,iUF!$C$11:$D$109,2,FALSE),\"\"),\"\")","v":""},null,{"$f":"IF(D90<>\"\",IFERROR(VLOOKUP(D90,iCONDOMINI!$B$11:$C$109,2,FALSE),\"\"),\"\")","v":""}]
[null,"U81",null,{"$f":"IF(G91<>\"\",IFERROR(VLOOKUP(B91,iUF!$C$11:$D$109,2,FALSE),\"\"),\"\")","v":""},null,{"$f":"IF(D91<>\"\",IFERROR(VLOOKUP(D91,iCONDOMINI!$B$11:$C$109,2,FALSE),\"\"),\"\")","v":""}]
[null,"U82",null,{"$f":"IF(G92<>\"\",IFERROR(VLOOKUP(B92,iUF!$C$11:$D$109,2,FALSE),\"\"),\"\")","v":""},null,{"$f":"IF(D92<>\"\",IFERROR(VLOOKUP(D92,iCONDOMINI!$B$11:$C$109,2,FALSE),\"\"),\"\")","v":""}]
[null,"U83",null,{"$f":"IF(G93<>\"\",IFERROR(VLOOKUP(B93,iUF!$C$11:$D$109,2,FALSE),\"\"),\"\")","v":""},null,{"$f":"IF(D93<>\"\",IFERROR(VLOOKUP(D93,iCONDOMINI!$B$11:$C$109,2,FALSE),\"\"),\"\")","v":""}]
[null,"U84",null,{"$f":"IF(G94<>\"\",IFERROR(VLOOKUP(B94,iUF!$C$11:$D$109,2,FALSE),\"\"),\"\")","v":""},null,{"$f":"IF(D94<>\"\",IFERROR(VLOOKUP(D94,iCONDOMINI!$B$11:$C$109,2,FALSE),\"\"),\"\")","v":""}]
[null,"U85",null,{"$f":"IF(G95<>\"\",IFERROR(VLOOKUP(B95,iUF!$C$11:$D$109,2,FALSE),\"\"),\"\")","v":""},null,{"$f":"IF(D95<>\"\",IFERROR(VLOOKUP(D95,iCONDOMINI!$B$11:$C$109,2,FALSE),\"\"),\"\")","v":""}]
[null,"U86",null,{"$f":"IF(G96<>\"\",IFERROR(VLOOKUP(B96,iUF!$C$11:$D$109,2,FALSE),\"\"),\"\")","v":""},null,{"$f":"IF(D96<>\"\",IFERROR(VLOOKUP(D96,iCONDOMINI!$B$11:$C$109,2,FALSE),\"\"),\"\")","v":""}]
[null,"U87",null,{"$f":"IF(G97<>\"\",IFERROR(VLOOKUP(B97,iUF!$C$11:$D$109,2,FALSE),\"\"),\"\")","v":""},null,{"$f":"IF(D97<>\"\",IFERROR(VLOOKUP(D97,iCONDOMINI!$B$11:$C$109,2,FALSE),\"\"),\"\")","v":""}]
[null,"U88",null,{"$f":"IF(G98<>\"\",IFERROR(VLOOKUP(B98,iUF!$C$11:$D$109,2,FALSE),\"\"),\"\")","v":""},null,{"$f":"IF(D98<>\"\",IFERROR(VLOOKUP(D98,iCONDOMINI!$B$11:$C$109,2,FALSE),\"\"),\"\")","v":""}]
[null,"U89",null,{"$f":"IF(G99<>\"\",IFERROR(VLOOKUP(B99,iUF!$C$11:$D$109,2,FALSE),\"\"),\"\")","v":""},null,{"$f":"IF(D99<>\"\",IFERROR(VLOOKUP(D99,iCONDOMINI!$B$11:$C$109,2,FALSE),\"\"),\"\")","v":""}]
[null,"U90",null,{"$f":"IF(G100<>\"\",IFERROR(VLOOKUP(B100,iUF!$C$11:$D$109,2,FALSE),\"\"),\"\")","v":""},null,{"$f":"IF(D100<>\"\",IFERROR(VLOOKUP(D100,iCONDOMINI!$B$11:$C$109,2,FALSE),\"\"),\"\")","v":""}]
[null,"U91",null,{"$f":"IF(G101<>\"\",IFERROR(VLOOKUP(B101,iUF!$C$11:$D$109,2,FALSE),\"\"),\"\")","v":""},null,{"$f":"IF(D101<>\"\",IFERROR(VLOOKUP(D101,iCONDOMINI!$B$11:$C$109,2,FALSE),\"\"),\"\")","v":""}]
[null,"U92",null,{"$f":"IF(G102<>\"\",IFERROR(VLOOKUP(B102,iUF!$C$11:$D$109,2,FALSE),\"\"),\"\")","v":""},null,{"$f":"IF(D102<>\"\",IFERROR(VLOOKUP(D102,iCONDOMINI!$B$11:$C$109,2,FALSE),\"\"),\"\")","v":""}]
[null,"U93",null,{"$f":"IF(G103<>\"\",IFERROR(VLOOKUP(B103,iUF!$C$11:$D$109,2,FALSE),\"\"),\"\")","v":""},null,{"$f":"IF(D103<>\"\",IFERROR(VLOOKUP(D103,iCONDOMINI!$B$11:$C$109,2,FALSE),\"\"),\"\")","v":""}]
[null,"U94",null,{"$f":"IF(G104<>\"\",IFERROR(VLOOKUP(B104,iUF!$C$11:$D$109,2,FALSE),\"\"),\"\")","v":""},null,{"$f":"IF(D104<>\"\",IFERROR(VLOOKUP(D104,iCONDOMINI!$B$11:$C$109,2,FALSE),\"\"),\"\")","v":""}]
[null,"U95",null,{"$f":"IF(G105<>\"\",IFERROR(VLOOKUP(B105,iUF!$C$11:$D$109,2,FALSE),\"\"),\"\")","v":""},null,{"$f":"IF(D105<>\"\",IFERROR(VLOOKUP(D105,iCONDOMINI!$B$11:$C$109,2,FALSE),\"\"),\"\")","v":""}]
[null,"U96",null,{"$f":"IF(G106<>\"\",IFERROR(VLOOKUP(B106,iUF!$C$11:$D$109,2,FALSE),\"\"),\"\")","v":""},null,{"$f":"IF(D106<>\"\",IFERROR(VLOOKUP(D106,iCONDOMINI!$B$11:$C$109,2,FALSE),\"\"),\"\")","v":""}]
[null,"U97",null,{"$f":"IF(G107<>\"\",IFERROR(VLOOKUP(B107,iUF!$C$11:$D$109,2,FALSE),\"\"),\"\")","v":""},null,{"$f":"IF(D107<>\"\",IFERROR(VLOOKUP(D107,iCONDOMINI!$B$11:$C$109,2,FALSE),\"\"),\"\")","v":""}]
[null,"U98",null,{"$f":"IF(G108<>\"\",IFERROR(VLOOKUP(B108,iUF!$C$11:$D$109,2,FALSE),\"\"),\"\")","v":""},null,{"$f":"IF(D108<>\"\",IFERROR(VLOOKUP(D108,iCONDOMINI!$B$11:$C$109,2,FALSE),\"\"),\"\")","v":""}]
[null,"U99",null,{"$f":"IF(G109<>\"\",IFERROR(VLOOKUP(B109,iUF!$C$11:$D$109,2,FALSE),\"\"),\"\")","v":""},null,{"$f":"IF(D109<>\"\",IFERROR(VLOOKUP(D109,iCONDOMINI!$B$11:$C$109,2,FALSE),\"\"),\"\")","v":""}]
[null,null,""]

{"sheet":"iCONDOMINI","index":4,"n_rows":110,"n_cols":73,"rows_kept":110,"cut":false,"hidden":true,"merged":[]}
[null,"È consentito variare i valori delle sole celle con sfondo bianco. \nI dati delle colonne con colore del testo rosso scuro devono essere necessariamente forniti.",null,null,null,null,null,null,null,null,null,null,null,""]
[null,"Per aggiungere ulteriori condomini occorre scoprire le righe nascoste e scrivere i relativi dati. ",null,null,null,null,null,null,null,null,null,null,null,""]
[null," Per aggiungere altri comproprietari occorre scoprire le colonne nascoste e scrivere i relativi dati."]
[]
[null,{"$f":"iDG!B32","v":"Condominio Palazzo Duck"}]
[]
[]
[null,null,"CONDOMINI",null,null,null,null,null,null,null,null,null,null,"1° PROPRIETARIO o INTESTATARIO",null,null,null,null,null,null,null,null,null,"2° PROPRIETARIO o INTESTATARIO",null,null,null,null,null,null,null,null,null,"3° PROPRIETARIO o INTESTATARIO",null,null,null,null,null,null,null,null,null,"4° PROPRIETARIO o INTESTATARIO",null,null,null,null,null,null,null,null,null,"5° PROPRIETARIO o INTESTATARIO",null,null,null,null,null,null,null,null,null,"6° PROPRIETARIO o INTESTATARIO"]
[null,"CODICE","DATI IDENTIFICATIVI",null,"DATI DI CONTATTO",null,null,null,null,null,null,null,null,"%",null,"NOME","DATI FISCALI",null,null,null,null,"DATI DI CONTATTO",null,"%",null,"NOME","DATI FISCALI",null,null,null,null,"DATI DI CONTATTO",null,"%",null,"NOME","DATI FISCALI",null,null,null,null,"DATI DI CONTATTO",null,"%",null,"NOME","DATI FISCALI",null,null,null,null,"DATI DI CONTATTO",null,"%",null,"NOME","DATI FISCALI",null,null,null,null,"DATI DI CONTATTO",null,"%",null,"NOME","DATI FISCALI",null,null,null,null,"DATI DI CONTATTO"]
[null,"COND.","DENOMINAZIONE","G","REFERENTE","INDIRIZZO","CAP","CITTÀ","PROV.","TELEFONO","CELLULLARE","INDIRIZZO EMAIL","INDIRIZZO PEC","PROP.",null,"PROPRIO o COMMERCIALE","C.F.","DOMICILIO FISCALE","CAP","CITTÀ","Prov.","TEL./CELL.","INDIRIZZO EMAIL","PROP.",null,"PROPRIO o COMMERCIALE","C.F.","DOMICILIO FISCALE","CAP","CITTÀ","Prov.","TEL./CELL.","INDIRIZZO EMAIL","PROP.",null,"PROPRIO o COMMERCIALE","C.F.","DOMICILIO FISCALE","CAP","CITTÀ","Prov.","TEL./CELL.","INDIRIZZO EMAIL","PROP.",null,"PROPRIO o COMMERCIALE","C.F.","DOMICILIO FISCALE","CAP","CITTÀ","Prov.","TEL./CELL.","INDIRIZZO EMAIL","PROP.",null,"PROPRIO o COMMERCIALE","C.F.","DOMICILIO FISCALE","CAP","CITTÀ","Prov.","TEL./CELL.","INDIRIZZO EMAIL","PROP.",null,"PROPRIO o COMMERCIALE","C.F.","DOMICILIO FISCALE","CAP","CITTÀ","Prov.","TEL./CELL.","INDIRIZZO EMAIL"]
[null,"C01","Paperoga","M","Fethry Duck","Via degli Alberi Spogli, 1","99999","PAPEROPOLI","PP",null,null,null,null,100,"Fethry Duck","DKCFTRN66L30C999N","Via degli Alberi Spogli, 1","99999","PAPEROPOLI","PP",null,null,null,null,null,null,null,null,null,null,null,0]
[null,"C02","Ciccio","M","Gus Goose","Via degli Alberi Spogli, 2","99999","PAPEROPOLI","PP",null,null,null,null,100,"Gus Goose","GSOGSU43R21C999Z","Via degli Alberi Spogli, 2","99999","PAPEROPOLI","PP",null,null,null,null,null,null,null,null,null,null,null,0]
[null,"C03","Gastone","M","Gladstone Glander","Via degli Alberi Spogli, 3","99999","PAPEROPOLI","PP",null,null,null,null,100,"Gladstone Glander","GLNGLD009H06C999H","Via degli Alberi Spogli, 3","99999","PAPEROPOLI","PP",null,null,null,null,null,null,null,null,null,null,null,0]
[null,"C04","I tre nipotini","P","Huey Duck","Via degli Alberi Spogli, 4","99999","PAPEROPOLI","PP",null,null,null,null,33.340000000000003,"Huey Duck","DCKHYU43M55C9992S","Via degli Alberi Spogli, 4","99999","PAPEROPOLI","PP",null,null,33.33,"Dewey Duck","DCKDWY43M55C9992BS","Via degli Alberi Spogli, 4","99999","PAPEROPOLI","PP",null,null,33.33,"Louie Duck","DCKLUI43M55C9992C","Via degli Alberi Spogli, 4","99999","PAPEROPOLI","PP"]
[null,"C05","Nonna Papera","F","Elvira Coot","Viale dei Platani, 1","99999","PAPEROPOLI","PP",null,null,null,null,100,"Elvira Coot","CTOLVR60C53C999R","Viale dei Platani, 1","99999","PAPEROPOLI","PP",null,null,null,null,null,null,null,null,null,null,null,0]
[null,"C06","Fidanzati Paperino-Paperina","T","Donald Duck","Viale dei Platani, 1","99999","PAPEROPOLI","PP",null,null,null,null,25,"Donald Duck","DKCDNL47L30C999Y","Viale dei Platani, 1","99999","PAPEROPOLI","PP",null,null,75,"Daisy Duck","DKCDSY56C55C999K","Viale dei Platani, 1","99999","PAPEROPOLI","PP",null,null,0]
[null,"C07"]
[null,"C08"]
[null,"C09"]
[null,"C10"]
[null,"C11"]
[null,"C12"]
[null,"C13"]
[null,"C14"]
[null,"C15"]
[null,"C16"]
[null,"C17"]
[null,"C18"]
[null,"C19"]
[null,"C20"]
[null,"C21"]
[null,"C22"]
[null,"C23"]
[null,"C24"]
[null,"C25"]
[null,"C26"]
[null,"C27"]
[null,"C28"]
[null,"C29"]
[null,"C30"]
[null,"C31"]
[null,"C32"]
[null,"C33"]
[null,"C34"]
[null,"C35"]
[null,"C36"]
[null,"C37"]
[null,"C38"]
[null,"C39"]
[null,"C40"]
[null,"C41"]
[null,"C42"]
[null,"C43"]
[null,"C44"]
[null,"C45"]
[null,"C46"]
[null,"C47"]
[null,"C48"]
[null,"C49"]
[null,"C50"]
[null,"C51"]
[null,"C52"]
[null,"C53"]
[null,"C54"]
[null,"C55"]
[null,"C56"]
[null,"C57"]
[null,"C58"]
[null,"C59"]
[null,"C60"]
[null,"C61"]
[null,"C62"]
[null,"C63"]
[null,"C64"]
[null,"C65"]
[null,"C66"]
[null,"C67"]
[null,"C68"]
[null,"C69"]
[null,"C70"]
[null,"C71"]
[null,"C72"]
[null,"C73"]
[null,"C74"]
[null,"C75"]
[null,"C76"]
[null,"C77"]
[null,"C78"]
[null,"C79"]
[null,"C80"]
[null,"C81"]
[null,"C82"]
[null,"C83"]
[null,"C84"]
[null,"C85"]
[null,"C86"]
[null,"C87"]
[null,"C88"]
[null,"C89"]
[null,"C90"]
[null,"C91"]
[null,"C92"]
[null,"C93"]
[null,"C94"]
[null,"C95"]
[null,"C96"]
[null,"C97"]
[null,"C98"]
[null,"C99"]
[null,""]

{"sheet":"iTABUF","index":5,"n_rows":111,"n_cols":14,"rows_kept":111,"cut":false,"hidden":true,"merged":[[8,0,9,0],[8,1,9,1],[8,2,9,2]]}
[null,"È consentito variare i valori delle sole celle con sfondo bianco.\nI dati delle colonne con i testi in rosso scuro devono essere necessariamente forniti.",null,null,null,null,null,null,null,null,null,null,null,0]
[]
[]
[]
[null,{"$f":"iDG!B32","v":"Condominio Palazzo Duck"}]
[]
[]
[null,"TABELLE MILLESIMALI per UNITÀ FUNZIONALI"]
[null,"Codice Unità\nFunzionale","Codice Unità\nImmobiliare\ncui appartiene","Tabella A","Tabella B","Tabella C","Tabella D","Tabella E","Tabella F","Tabella G","Tabella H","Tabella I","Tabella J"]
[null,null,null,{"$f":"iDG!$B52","v":"Proprietà"},{"$f":"iDG!$B53","v":"Scala"},{"$f":"iDG!$B54","v":"Ascensore"},{"$f":"iDG!$B55","v":"Abitazioni"},{"$f":"iDG!$B56","v":"Negozi"},{"$f":"iDG!$B57","v":0},{"$f":"iDG!$B58","v":0},{"$f":"iDG!$B59","v":0},{"$f":"iDG!$B60","v":0},{"$f":"iDG!$B61","v":0}]
[null,{"$f":"iUF!B11","v":"UF01"},{"$f":"IF(iUF!C11<>\"\",iUF!C11,\"\")","v":"U05"},8.9879999999999995,22.538,22.538,13.315]
[null,{"$f":"iUF!B12","v":"UF02"},{"$f":"IF(iUF!C12<>\"\",iUF!C12,\"\")","v":"U06"},6.0869999999999997,15.263,15.263,9.0169999999999995]
[null,{"$f":"iUF!B13","v":"UF03"},{"$f":"IF(iUF!C13<>\"\",iUF!C13,\"\")","v":"U07"},8.6129999999999995,21.596,21.596,12.759]
[null,{"$f":"iUF!B14","v":"UF04"},{"$f":"IF(iUF!C14<>\"\",iUF!C14,\"\")","v":"U07"},10.718,26.875,26.875,15.878]
[null,{"$f":"iUF!B15","v":"UF05"},{"$f":"IF(iUF!C15<>\"\",iUF!C15,\"\")","v":"U07"},0.54800000000000004,1.3740000000000001,1.3740000000000001,0.81200000000000006]
[null,{"$f":"iUF!B16","v":"UF06"},{"$f":"IF(iUF!C16<>\"\",iUF!C16,\"\")","v":"U07"},0.54800000000000004,1.3740000000000001,1.3740000000000001,0.81200000000000006]
[null,{"$f":"iUF!B17","v":"UF07"},{"$f":"IF(iUF!C17<>\"\",iUF!C17,\"\")","v":"U05"},0.54800000000000004,1.3740000000000001,1.3740000000000001,0.81200000000000006]
[null,{"$f":"iUF!B18","v":"UF08"},{"$f":"IF(iUF!C18<>\"\",iUF!C18,\"\")","v":"U06"},0.54800000000000004,1.3740000000000001,1.3740000000000001,0.81200000000000006]
[null,{"$f":"iUF!B19","v":"UF09"},{"$f":"IF(iUF!C19<>\"\",iUF!C19,\"\")","v":"U08"},13.183999999999999,33.057000000000002,33.057000000000002,19.53]
[null,{"$f":"iUF!B20","v":"UF10"},{"$f":"IF(iUF!C20<>\"\",iUF!C20,\"\")","v":"U09"},22.138000000000002,55.509,55.509,32.795000000000002]
[null,{"$f":"iUF!B21","v":"UF11"},{"$f":"IF(iUF!C21<>\"\",iUF!C21,\"\")","v":"U01"},52.392000000000003,null,null,null,161.221]
[null,{"$f":"iUF!B22","v":"UF12"},{"$f":"IF(iUF!C22<>\"\",iUF!C22,\"\")","v":"U02"},35.476999999999997,null,null,null,109.17]
[null,{"$f":"iUF!B23","v":"UF13"},{"$f":"IF(iUF!C23<>\"\",iUF!C23,\"\")","v":"U03"},100.43899999999999,null,null,null,309.06900000000002]
[null,{"$f":"iUF!B24","v":"UF14"},{"$f":"IF(iUF!C24<>\"\",iUF!C24,\"\")","v":"U04"},136.66399999999999,null,null,null,420.54]
[null,{"$f":"iUF!B25","v":"UF15"},{"$f":"IF(iUF!C25<>\"\",iUF!C25,\"\")","v":"U07"},2.556,1.8939999999999999,1.8939999999999999,3.7869999999999999]
[null,{"$f":"iUF!B26","v":"UF16"},{"$f":"IF(iUF!C26<>\"\",iUF!C26,\"\")","v":"U05"},2.556,1.8939999999999999,1.8939999999999999,3.7869999999999999]
[null,{"$f":"iUF!B27","v":"UF17"},{"$f":"IF(iUF!C27<>\"\",iUF!C27,\"\")","v":"U05"},171.87700000000001,204.804,204.804,254.62299999999999]
[null,{"$f":"iUF!B28","v":"UF18"},{"$f":"IF(iUF!C28<>\"\",iUF!C28,\"\")","v":"U06"},115.065,137.108,137.108,170.46]
[null,{"$f":"iUF!B29","v":"UF19"},{"$f":"IF(iUF!C29<>\"\",iUF!C29,\"\")","v":"U07"},305.25100000000003,464.81600000000003,464.81600000000003,452.20400000000001]
[null,{"$f":"iUF!B30","v":"UF20"},{"$f":"IF(iUF!C30<>\"\",iUF!C30,\"\")","v":"U07"},5.4859999999999998,8.3539999999999992,8.3539999999999992,8.1270000000000007]
[null,{"$f":"iUF!B31","v":"UF21"},{"$f":"IF(iUF!C31<>\"\",iUF!C31,\"\")","v":"U07"},0.317,0.79600000000000004,0.79600000000000004,0.47]
[null,{"$f":"iUF!B32","v":"UF22"},{"$f":"IF(iUF!C32<>\"\",iUF!C32,\"\")","v":""}]
[null,{"$f":"iUF!B33","v":"UF23"},{"$f":"IF(iUF!C33<>\"\",iUF!C33,\"\")","v":""}]
[null,{"$f":"iUF!B34","v":"UF24"},{"$f":"IF(iUF!C34<>\"\",iUF!C34,\"\")","v":""}]
[null,{"$f":"iUF!B35","v":"UF25"},{"$f":"IF(iUF!C35<>\"\",iUF!C35,\"\")","v":""}]
[null,{"$f":"iUF!B36","v":"UF26"},{"$f":"IF(iUF!C36<>\"\",iUF!C36,\"\")","v":""}]
[null,{"$f":"iUF!B37","v":"UF27"},{"$f":"IF(iUF!C37<>\"\",iUF!C37,\"\")","v":""}]
[null,{"$f":"iUF!B38","v":"UF28"},{"$f":"IF(iUF!C38<>\"\",iUF!C38,\"\")","v":""}]
[null,{"$f":"iUF!B39","v":"UF29"},{"$f":"IF(iUF!C39<>\"\",iUF!C39,\"\")","v":""}]
[null,{"$f":"iUF!B40","v":"UF30"},{"$f":"IF(iUF!C40<>\"\",iUF!C40,\"\")","v":""}]
[null,{"$f":"iUF!B41","v":"UF31"},{"$f":"IF(iUF!C41<>\"\",iUF!C41,\"\")","v":""}]
[null,{"$f":"iUF!B42","v":"UF32"},{"$f":"IF(iUF!C42<>\"\",iUF!C42,\"\")","v":""}]
[null,{"$f":"iUF!B43","v":"UF33"},{"$f":"IF(iUF!C43<>\"\",iUF!C43,\"\")","v":""}]
[null,{"$f":"iUF!B44","v":"UF34"},{"$f":"IF(iUF!C44<>\"\",iUF!C44,\"\")","v":""}]
[null,{"$f":"iUF!B45","v":"UF35"},{"$f":"IF(iUF!C45<>\"\",iUF!C45,\"\")","v":""}]
[null,{"$f":"iUF!B46","v":"UF36"},{"$f":"IF(iUF!C46<>\"\",iUF!C46,\"\")","v":""}]
[null,{"$f":"iUF!B47","v":"UF37"},{"$f":"IF(iUF!C47<>\"\",iUF!C47,\"\")","v":""}]
[null,{"$f":"iUF!B48","v":"UF38"},{"$f":"IF(iUF!C48<>\"\",iUF!C48,\"\")","v":""}]
[null,{"$f":"iUF!B49","v":"UF39"},{"$f":"IF(iUF!C49<>\"\",iUF!C49,\"\")","v":""}]
[null,{"$f":"iUF!B50","v":"UF40"},{"$f":"IF(iUF!C50<>\"\",iUF!C50,\"\")","v":""}]
[null,{"$f":"iUF!B51","v":"UF41"},{"$f":"IF(iUF!C51<>\"\",iUF!C51,\"\")","v":""}]
[null,{"$f":"iUF!B52","v":"UF42"},{"$f":"IF(iUF!C52<>\"\",iUF!C52,\"\")","v":""}]
[null,{"$f":"iUF!B53","v":"UF43"},{"$f":"IF(iUF!C53<>\"\",iUF!C53,\"\")","v":""}]
[null,{"$f":"iUF!B54","v":"UF44"},{"$f":"IF(iUF!C54<>\"\",iUF!C54,\"\")","v":""}]
[null,{"$f":"iUF!B55","v":"UF45"},{"$f":"IF(iUF!C55<>\"\",iUF!C55,\"\")","v":""}]
[null,{"$f":"iUF!B56","v":"UF46"},{"$f":"IF(iUF!C56<>\"\",iUF!C56,\"\")","v":""}]
[null,{"$f":"iUF!B57","v":"UF47"},{"$f":"IF(iUF!C57<>\"\",iUF!C57,\"\")","v":""}]
[null,{"$f":"iUF!B58","v":"UF48"},{"$f":"IF(iUF!C58<>\"\",iUF!C58,\"\")","v":""}]
[null,{"$f":"iUF!B59","v":"UF49"},{"$f":"IF(iUF!C59<>\"\",iUF!C59,\"\")","v":""}]
[null,{"$f":"iUF!B60","v":"UF50"},{"$f":"IF(iUF!C60<>\"\",iUF!C60,\"\")","v":""}]
[null,{"$f":"iUF!B61","v":"UF51"},{"$f":"IF(iUF!C61<>\"\",iUF!C61,\"\")","v":""}]
[null,{"$f":"iUF!B62","v":"UF52"},{"$f":"IF(iUF!C62<>\"\",iUF!C62,\"\")","v":""}]
[null,{"$f":"iUF!B63","v":"UF53"},{"$f":"IF(iUF!C63<>\"\",iUF!C63,\"\")","v":""}]
[null,{"$f":"iUF!B64","v":"UF54"},{"$f":"IF(iUF!C64<>\"\",iUF!C64,\"\")","v":""}]
[null,{"$f":"iUF!B65","v":"UF55"},{"$f":"IF(iUF!C65<>\"\",iUF!C65,\"\")","v":""}]
[null,{"$f":"iUF!B66","v":"UF56"},{"$f":"IF(iUF!C66<>\"\",iUF!C66,\"\")","v":""}]
[null,{"$f":"iUF!B67","v":"UF57"},{"$f":"IF(iUF!C67<>\"\",iUF!C67,\"\")","v":""}]
[null,{"$f":"iUF!B68","v":"UF58"},{"$f":"IF(iUF!C68<>\"\",iUF!C68,\"\")","v":""}]
[null,{"$f":"iUF!B69","v":"UF59"},{"$f":"IF(iUF!C69<>\"\",iUF!C69,\"\")","v":""}]
[null,{"$f":"iUF!B70","v":"UF60"},{"$f":"IF(iUF!C70<>\"\",iUF!C70,\"\")","v":""}]
[null,{"$f":"iUF!B71","v":"UF61"},{"$f":"IF(iUF!C71<>\"\",iUF!C71,\"\")","v":""}]
[null,{"$f":"iUF!B72","v":"UF62"},{"$f":"IF(iUF!C72<>\"\",iUF!C72,\"\")","v":""}]
[null,{"$f":"iUF!B73","v":"UF63"},{"$f":"IF(iUF!C73<>\"\",iUF!C73,\"\")","v":""}]
[null,{"$f":"iUF!B74","v":"UF64"},{"$f":"IF(iUF!C74<>\"\",iUF!C74,\"\")","v":""}]
[null,{"$f":"iUF!B75","v":"UF65"},{"$f":"IF(iUF!C75<>\"\",iUF!C75,\"\")","v":""}]
[null,{"$f":"iUF!B76","v":"UF66"},{"$f":"IF(iUF!C76<>\"\",iUF!C76,\"\")","v":""}]
[null,{"$f":"iUF!B77","v":"UF67"},{"$f":"IF(iUF!C77<>\"\",iUF!C77,\"\")","v":""}]
[null,{"$f":"iUF!B78","v":"UF68"},{"$f":"IF(iUF!C78<>\"\",iUF!C78,\"\")","v":""}]
[null,{"$f":"iUF!B79","v":"UF69"},{"$f":"IF(iUF!C79<>\"\",iUF!C79,\"\")","v":""}]
[null,{"$f":"iUF!B80","v":"UF70"},{"$f":"IF(iUF!C80<>\"\",iUF!C80,\"\")","v":""}]
[null,{"$f":"iUF!B81","v":"UF71"},{"$f":"IF(iUF!C81<>\"\",iUF!C81,\"\")","v":""}]
[null,{"$f":"iUF!B82","v":"UF72"},{"$f":"IF(iUF!C82<>\"\",iUF!C82,\"\")","v":""}]
[null,{"$f":"iUF!B83","v":"UF73"},{"$f":"IF(iUF!C83<>\"\",iUF!C83,\"\")","v":""}]
[null,{"$f":"iUF!B84","v":"UF74"},{"$f":"IF(iUF!C84<>\"\",iUF!C84,\"\")","v":""}]
[null,{"$f":"iUF!B85","v":"UF75"},{"$f":"IF(iUF!C85<>\"\",iUF!C85,\"\")","v":""}]
[null,{"$f":"iUF!B86","v":"UF76"},{"$f":"IF(iUF!C86<>\"\",iUF!C86,\"\")","v":""}]
[null,{"$f":"iUF!B87","v":"UF77"},{"$f":"IF(iUF!C87<>\"\",iUF!C87,\"\")","v":""}]
[null,{"$f":"iUF!B88","v":"UF78"},{"$f":"IF(iUF!C88<>\"\",iUF!C88,\"\")","v":""}]
[null,{"$f":"iUF!B89","v":"UF79"},{"$f":"IF(iUF!C89<>\"\",iUF!C89,\"\")","v":""}]
[null,{"$f":"iUF!B90","v":"UF80"},{"$f":"IF(iUF!C90<>\"\",iUF!C90,\"\")","v":""}]
[null,{"$f":"iUF!B91","v":"UF81"},{"$f":"IF(iUF!C91<>\"\",iUF!C91,\"\")","v":""}]
[null,{"$f":"iUF!B92","v":"UF82"},{"$f":"IF(iUF!C92<>\"\",iUF!C92,\"\")","v":""}]
[null,{"$f":"iUF!B93","v":"UF83"},{"$f":"IF(iUF!C93<>\"\",iUF!C93,\"\")","v":""}]
[null,{"$f":"iUF!B94","v":"UF84"},{"$f":"IF(iUF!C94<>\"\",iUF!C94,\"\")","v":""}]
[null,{"$f":"iUF!B95","v":"UF85"},{"$f":"IF(iUF!C95<>\"\",iUF!C95,\"\")","v":""}]
[null,{"$f":"iUF!B96","v":"UF86"},{"$f":"IF(iUF!C96<>\"\",iUF!C96,\"\")","v":""}]
[null,{"$f":"iUF!B97","v":"UF87"},{"$f":"IF(iUF!C97<>\"\",iUF!C97,\"\")","v":""}]
[null,{"$f":"iUF!B98","v":"UF88"},{"$f":"IF(iUF!C98<>\"\",iUF!C98,\"\")","v":""}]
[null,{"$f":"iUF!B99","v":"UF89"},{"$f":"IF(iUF!C99<>\"\",iUF!C99,\"\")","v":""}]
[null,{"$f":"iUF!B100","v":"UF90"},{"$f":"IF(iUF!C100<>\"\",iUF!C100,\"\")","v":""}]
[null,{"$f":"iUF!B101","v":"UF91"},{"$f":"IF(iUF!C101<>\"\",iUF!C101,\"\")","v":""}]
[null,{"$f":"iUF!B102","v":"UF92"},{"$f":"IF(iUF!C102<>\"\",iUF!C102,\"\")","v":""}]
[null,{"$f":"iUF!B103","v":"UF93"},{"$f":"IF(iUF!C103<>\"\",iUF!C103,\"\")","v":""}]
[null,{"$f":"iUF!B104","v":"UF94"},{"$f":"IF(iUF!C104<>\"\",iUF!C104,\"\")","v":""}]
[null,{"$f":"iUF!B105","v":"UF95"},{"$f":"IF(iUF!C105<>\"\",iUF!C105,\"\")","v":""}]
[null,{"$f":"iUF!B106","v":"UF96"},{"$f":"IF(iUF!C106<>\"\",iUF!C106,\"\")","v":""}]
[null,{"$f":"iUF!B107","v":"UF97"},{"$f":"IF(iUF!C107<>\"\",iUF!C107,\"\")","v":""}]
[null,{"$f":"iUF!B108","v":"UF98"},{"$f":"IF(iUF!C108<>\"\",iUF!C108,\"\")","v":""}]
[null,{"$f":"iUF!B109","v":"UF99"},{"$f":"IF(iUF!C109<>\"\",iUF!C109,\"\")","v":""}]
[null,null,"TOTALI",{"$f":"SUM(D11:D109)","v":999.99999999999989},{"$f":"SUM(E11:E109)","v":1000.0000000000002},1000.0000000000002,1000,1000,0,0,0,0,0]
[null,null,null,null,null,null,null,null,null,null,null,null,null,0]

{"sheet":"iPCU","index":6,"n_rows":207,"n_cols":7,"rows_kept":207,"cut":false,"hidden":true,"merged":[[7,1,8,1],[7,2,8,2],[7,3,8,3]]}
[null,"È consentito variare i valori delle sole celle con sfondo bianco.",null,null,null,null,0]
[]
[]
[]
[null,{"$f":"iDG!B32","v":"Condominio Palazzo Duck"}]
[null,"PIANO GENERALE DEI CONTI"]
[null,"PIANO DELLE SPESE E DELLE USCITE"]
[null,"SEZIONI, CAPITOLI e VOCI","CODICE\nCONTO","TABELLA\nRIPARTO","PERCENTUALE SUDDIVISIONE"]
[null,null,null,null,"PROPRIETARI","INQUILINI"]
[null,"SPESE","S"]
[null,"SPESE GENERALI","S.01"]
[null,"COMPETENZE BANCARIE (Oneri,Commissioni, interessi, ecc)","S.01.01","A",1,{"$f":"IF(D12<>\"\",1-E12,0)","v":0}]
[null,"CANCELLERIA","S.01.02","A",1,{"$f":"IF(D13<>\"\",1-E13,0)","v":0}]
[null,"POSTALI, TELEGRAFICHE, TELEFONICHE E WEB ","S.01.03","A",1,0]
[null,"DIRITTI BOLLI TASSE","S.01.04","A",1,0]
[null,"SPESE PER ADEMPIMENTI FISCALI","S.01.05","A",1,0]
[null,"COMPENSI AMMINISTRATORE","S.01.06","A",1,0]
[null,"COMPENSI A TERZI (consulenti, ...)","S.01.07","A",1,0]
[null,"SPESE LEGALI, CONTRATTUALI e RECUPERO CREDITI","S.01.08","A",1,0]
[null,"ASSICURAZIONE FABBRICATO","S.01.09","A",1,0]
[null,"ALTRE SPESE GENERALI","S.01.10","A",1,0]
[null,null,"S.01.11",null,null,0]
[null,null,"S.01.12",null,null,0]
[null,null,"S.01.13",null,null,0]
[null,null,"S.01.14",null,null,0]
[null,null,"S.01.15",null,null,0]
[null,"PULIZIE","S.02"]
[null,"PULIZIE SCALE: PERSONALE","S.02.01","B",null,{"$f":"IF(D28<>\"\",1-E28,0)","v":1}]
[null,"PULIZIE SCALE: ATTREZZI E PRODOTTI","S.02.02","B",null,{"$f":"IF(D29<>\"\",1-E29,0)","v":1}]
[null,"MANUTENZIONE ORDINARIA SCALE","S.02.03","B",null,1]
[null,"ALTRE SPESE DOCUMENTATE","S.02.04","B",null,1]
[null,null,"S.02.05","",null,0]
[null,null,"S.02.06","",null,0]
[null,null,"S.02.07","",null,0]
[null,null,"S.02.08","",null,0]
[null,null,"S.02.09","",null,0]
[null,null,"S.02.10","",null,0]
[null,"ASCENSORE","S.03"]
[null,"CONTRATTO MANUTENZIONE ASCENSORE","S.03.01","C",null,{"$f":"IF(D39<>\"\",1-E39,0)","v":1}]
[null,"VERIFICA PERIODICA ASCENSORE","S.03.02","C",null,{"$f":"IF(D40<>\"\",1-E40,0)","v":1}]
[null,"RIPARAZIONI  ASCENSORE","S.03.03","C",null,1]
[null,"ADEGUAMENTO ASCENSORE","S.03.04","C",null,1]
[null,"ALTRE SPESE DOCUMENTATE","S.03.05","C",null,1]
[null,null,"S.03.06",null,null,0]
[null,null,"S.03.07",null,null,0]
[null,null,"S.03.08",null,null,0]
[null,null,"S.03.09",null,null,0]
[null,null,"S.03.10",null,null,0]
[null,"CONSUMI DI ENERGIA E ACQUA","S.04"]
[null,"ENERGIA ILLUMINAZIONE","S.04.01","B",null,{"$f":"IF(D50<>\"\",1-E50,0)","v":1}]
[null,"ENERGIA ALIMENTAZIONE ASCENSORE","S.04.02","C",null,{"$f":"IF(D51<>\"\",1-E51,0)","v":1}]
[null,"ENERGIA ALIMENTAZIONE IMPIANTO TV","S.04.03","F",null,1]
[null,null,"S.04.04",null,null,0]
[null,null,"S.04.05",null,null,0]
[null,null,"S.04.06",null,null,0]
[null,null,"S.04.07",null,null,0]
[null,null,"S.04.08",null,null,0]
[null,null,"S.04.09",null,null,0]
[null,null,"S.04.10",null,null,0]
[null,"IMPIANTI TV e CITOFONICO","S.05"]
[null,"MANUTENZIONE E RIPARAZIONE CITOFONO","S.05.01","G",null,{"$f":"IF(D61<>\"\",1-E61,0)","v":1}]
[null,"ALTRE SPESE DOCUMENTATE SU CITOFONO","S.05.02","G",1,{"$f":"IF(D62<>\"\",1-E62,0)","v":0}]
[null,"MANUTENZIONE E RIPARAZIONE IMPIANTO TV","S.05.03","F",null,1]
[null,"ALTRE SPESE DOCUMENTATE SU IMPIANTO TV","S.05.04","F",1,0]
[null,null,"S.05.05",null,null,0]
[null,null,"S.05.06",null,null,0]
[null,null,"S.05.07",null,null,0]
[null,null,"S.05.08",null,null,0]
[null,null,"S.05.09",null,null,0]
[null,null,"S.05.10",null,null,0]
[null,"MANUTENZIONI ORDINARIE EDILI","S.06"]
[null,"MANUTENZIONI ORDINARIE PARTI COMUNI INTERO EDIFICIO","S.06.01","A",null,{"$f":"IF(D72<>\"\",1-E72,0)","v":1}]
[null,"MANUTENZIONI ORDINARIE PARTI COMUNI ABITAZIONI","S.06.02","D",null,{"$f":"IF(D73<>\"\",1-E73,0)","v":1}]
[null,"MANUTENZIONI ORDINARIE PARTI COMUNI NEGOZI","S.06.03","E",null,{"$f":"IF(D74<>\"\",1-E74,0)","v":1}]
[null,null,"S.06.04",null,null,{"$f":"IF(D75<>\"\",1-E75,0)","v":0}]
[null,null,"S.06.05",null,null,{"$f":"IF(D76<>\"\",1-E76,0)","v":0}]
[null,"MANUTENZIONI STRAORDINARIE EDILI","S.07"]
[null,"MANUTENZIONI STRAORDINARIE PARTI COMUNI INTERO EDIFICIO","S.07.01","A",1,{"$f":"IF(D78<>\"\",1-E78,0)","v":0}]
[null,"MANUTENZIONI STRAORDINARIE PARTI COMUNI ABITAZIONI","S.07.02","D",1,{"$f":"IF(D79<>\"\",1-E79,0)","v":0}]
[null,"MANUTENZIONI STRAORDINARIE PARTI COMUNI NEGOZI","S.07.03","E",1,{"$f":"IF(D80<>\"\",1-E80,0)","v":0}]
[null,null,"S.07.04",null,null,{"$f":"IF(D81<>\"\",1-E81,0)","v":0}]
[null,null,"S.07.05",null,null,{"$f":"IF(D82<>\"\",1-E82,0)","v":0}]
[null,"USCITE PER COSTITUZIONE DEPOSITI PRESSO TERZI e PRESTITI A TERZI","L"]
[null,"DEPOSITI CAUZIONALI","L.01.01","A"]
[null,"ACQUISTO VOUCHER LAVORI","L.01.02","A"]
[null,"PRESTITI A TERZI","L.01.03","A"]
[null,null,"L.01.04"]
[null,null,"L.01.05"]
[null,"SPESE PERSONALI CONDOMINI o ASSEGNATE DIRETTAMENTE AI CONDOMINI","P"]
[null,{"$f":"IF(iCONDOMINI!C11<>\"\",iCONDOMINI!C11,\"\")","v":"Paperoga"},"P.01.01"]
[null,{"$f":"IF(iCONDOMINI!C12<>\"\",iCONDOMINI!C12,\"\")","v":"Ciccio"},"P.01.02"]
[null,{"$f":"IF(iCONDOMINI!C13<>\"\",iCONDOMINI!C13,\"\")","v":"Gastone"},"P.01.03"]
[null,{"$f":"IF(iCONDOMINI!C14<>\"\",iCONDOMINI!C14,\"\")","v":"I tre nipotini"},"P.01.04"]
[null,{"$f":"IF(iCONDOMINI!C15<>\"\",iCONDOMINI!C15,\"\")","v":"Nonna Papera"},"P.01.05"]
[null,{"$f":"IF(iCONDOMINI!C16<>\"\",iCONDOMINI!C16,\"\")","v":"Fidanzati Paperino-Paperina"},"P.01.06"]
[null,{"$f":"IF(iCONDOMINI!C17<>\"\",iCONDOMINI!C17,\"\")","v":""},"P.01.07"]
[null,{"$f":"IF(iCONDOMINI!C18<>\"\",iCONDOMINI!C18,\"\")","v":""},"P.01.08"]
[null,{"$f":"IF(iCONDOMINI!C19<>\"\",iCONDOMINI!C19,\"\")","v":""},"P.01.09"]
[null,{"$f":"IF(iCONDOMINI!C20<>\"\",iCONDOMINI!C20,\"\")","v":""},"P.01.10"]
[null,{"$f":"IF(iCONDOMINI!C21<>\"\",iCONDOMINI!C21,\"\")","v":""},"P.01.11"]
[null,{"$f":"IF(iCONDOMINI!C22<>\"\",iCONDOMINI!C22,\"\")","v":""},"P.01.12"]
[null,{"$f":"IF(iCONDOMINI!C23<>\"\",iCONDOMINI!C23,\"\")","v":""},"P.01.13"]
[null,{"$f":"IF(iCONDOMINI!C24<>\"\",iCONDOMINI!C24,\"\")","v":""},"P.01.14"]
[null,{"$f":"IF(iCONDOMINI!C25<>\"\",iCONDOMINI!C25,\"\")","v":""},"P.01.15"]
[null,{"$f":"IF(iCONDOMINI!C26<>\"\",iCONDOMINI!C26,\"\")","v":""},"P.01.16"]
[null,{"$f":"IF(iCONDOMINI!C27<>\"\",iCONDOMINI!C27,\"\")","v":""},"P.01.17"]
[null,{"$f":"IF(iCONDOMINI!C28<>\"\",iCONDOMINI!C28,\"\")","v":""},"P.01.18"]
[null,{"$f":"IF(iCONDOMINI!C29<>\"\",iCONDOMINI!C29,\"\")","v":""},"P.01.19"]
[null,{"$f":"IF(iCONDOMINI!C30<>\"\",iCONDOMINI!C30,\"\")","v":""},"P.01.20"]
[null,{"$f":"IF(iCONDOMINI!C31<>\"\",iCONDOMINI!C31,\"\")","v":""},"P.01.21"]
[null,{"$f":"IF(iCONDOMINI!C32<>\"\",iCONDOMINI!C32,\"\")","v":""},"P.01.22"]
[null,{"$f":"IF(iCONDOMINI!C33<>\"\",iCONDOMINI!C33,\"\")","v":""},"P.01.23"]
[null,{"$f":"IF(iCONDOMINI!C34<>\"\",iCONDOMINI!C34,\"\")","v":""},"P.01.24"]
[null,{"$f":"IF(iCONDOMINI!C35<>\"\",iCONDOMINI!C35,\"\")","v":""},"P.01.25"]
[null,{"$f":"IF(iCONDOMINI!C36<>\"\",iCONDOMINI!C36,\"\")","v":""},"P.01.26"]
[null,{"$f":"IF(iCONDOMINI!C37<>\"\",iCONDOMINI!C37,\"\")","v":""},"P.01.27"]
[null,{"$f":"IF(iCONDOMINI!C38<>\"\",iCONDOMINI!C38,\"\")","v":""},"P.01.28"]
[null,{"$f":"IF(iCONDOMINI!C39<>\"\",iCONDOMINI!C39,\"\")","v":""},"P.01.29"]
[null,{"$f":"IF(iCONDOMINI!C40<>\"\",iCONDOMINI!C40,\"\")","v":""},"P.01.30"]
[null,{"$f":"IF(iCONDOMINI!C41<>\"\",iCONDOMINI!C41,\"\")","v":""},"P.01.31"]
[null,{"$f":"IF(iCONDOMINI!C42<>\"\",iCONDOMINI!C42,\"\")","v":""},"P.01.32"]
[null,{"$f":"IF(iCONDOMINI!C43<>\"\",iCONDOMINI!C43,\"\")","v":""},"P.01.33"]
[null,{"$f":"IF(iCONDOMINI!C44<>\"\",iCONDOMINI!C44,\"\")","v":""},"P.01.34"]
[null,{"$f":"IF(iCONDOMINI!C45<>\"\",iCONDOMINI!C45,\"\")","v":""},"P.01.35"]
[null,{"$f":"IF(iCONDOMINI!C46<>\"\",iCONDOMINI!C46,\"\")","v":""},"P.01.36"]
[null,{"$f":"IF(iCONDOMINI!C47<>\"\",iCONDOMINI!C47,\"\")","v":""},"P.01.37"]
[null,{"$f":"IF(iCONDOMINI!C48<>\"\",iCONDOMINI!C48,\"\")","v":""},"P.01.38"]
[null,{"$f":"IF(iCONDOMINI!C49<>\"\",iCONDOMINI!C49,\"\")","v":""},"P.01.39"]
[null,{"$f":"IF(iCONDOMINI!C50<>\"\",iCONDOMINI!C50,\"\")","v":""},"P.01.40"]
[null,{"$f":"IF(iCONDOMINI!C51<>\"\",iCONDOMINI!C51,\"\")","v":""},"P.01.41"]
[null,{"$f":"IF(iCONDOMINI!C52<>\"\",iCONDOMINI!C52,\"\")","v":""},"P.01.42"]
[null,{"$f":"IF(iCONDOMINI!C53<>\"\",iCONDOMINI!C53,\"\")","v":""},"P.01.43"]
[null,{"$f":"IF(iCONDOMINI!C54<>\"\",iCONDOMINI!C54,\"\")","v":""},"P.01.44"]
[null,{"$f":"IF(iCONDOMINI!C55<>\"\",iCONDOMINI!C55,\"\")","v":""},"P.01.45"]
[null,{"$f":"IF(iCONDOMINI!C56<>\"\",iCONDOMINI!C56,\"\")","v":""},"P.01.46"]
[null,{"$f":"IF(iCONDOMINI!C57<>\"\",iCONDOMINI!C57,\"\")","v":""},"P.01.47"]
[null,{"$f":"IF(iCONDOMINI!C58<>\"\",iCONDOMINI!C58,\"\")","v":""},"P.01.48"]
[null,{"$f":"IF(iCONDOMINI!C59<>\"\",iCONDOMINI!C59,\"\")","v":""},"P.01.49"]
[null,{"$f":"IF(iCONDOMINI!C60<>\"\",iCONDOMINI!C60,\"\")","v":""},"P.01.50"]
[null,{"$f":"IF(iCONDOMINI!C61<>\"\",iCONDOMINI!C61,\"\")","v":""},"P.01.51"]
[null,{"$f":"IF(iCONDOMINI!C62<>\"\",iCONDOMINI!C62,\"\")","v":""},"P.01.52"]
[null,{"$f":"IF(iCONDOMINI!C63<>\"\",iCONDOMINI!C63,\"\")","v":""},"P.01.53"]
[null,{"$f":"IF(iCONDOMINI!C64<>\"\",iCONDOMINI!C64,\"\")","v":""},"P.01.54"]
[null,{"$f":"IF(iCONDOMINI!C65<>\"\",iCONDOMINI!C65,\"\")","v":""},"P.01.55"]
[null,{"$f":"IF(iCONDOMINI!C66<>\"\",iCONDOMINI!C66,\"\")","v":""},"P.01.56"]
[null,{"$f":"IF(iCONDOMINI!C67<>\"\",iCONDOMINI!C67,\"\")","v":""},"P.01.57"]
[null,{"$f":"IF(iCONDOMINI!C68<>\"\",iCONDOMINI!C68,\"\")","v":""},"P.01.58"]
[null,{"$f":"IF(iCONDOMINI!C69<>\"\",iCONDOMINI!C69,\"\")","v":""},"P.01.59"]
[null,{"$f":"IF(iCONDOMINI!C70<>\"\",iCONDOMINI!C70,\"\")","v":""},"P.01.60"]
[null,{"$f":"IF(iCONDOMINI!C71<>\"\",iCONDOMINI!C71,\"\")","v":""},"P.01.61"]
[null,{"$f":"IF(iCONDOMINI!C72<>\"\",iCONDOMINI!C72,\"\")","v":""},"P.01.62"]
[null,{"$f":"IF(iCONDOMINI!C73<>\"\",iCONDOMINI!C73,\"\")","v":""},"P.01.63"]
[null,{"$f":"IF(iCONDOMINI!C74<>\"\",iCONDOMINI!C74,\"\")","v":""},"P.01.64"]
[null,{"$f":"IF(iCONDOMINI!C75<>\"\",iCONDOMINI!C75,\"\")","v":""},"P.01.65"]
[null,{"$f":"IF(iCONDOMINI!C76<>\"\",iCONDOMINI!C76,\"\")","v":""},"P.01.66"]
[null,{"$f":"IF(iCONDOMINI!C77<>\"\",iCONDOMINI!C77,\"\")","v":""},"P.01.67"]
[null,{"$f":"IF(iCONDOMINI!C78<>\"\",iCONDOMINI!C78,\"\")","v":""},"P.01.68"]
[null,{"$f":"IF(iCONDOMINI!C79<>\"\",iCONDOMINI!C79,\"\")","v":""},"P.01.69"]
[null,{"$f":"IF(iCONDOMINI!C80<>\"\",iCONDOMINI!C80,\"\")","v":""},"P.01.70"]
[null,{"$f":"IF(iCONDOMINI!C81<>\"\",iCONDOMINI!C81,\"\")","v":""},"P.01.71"]
[null,{"$f":"IF(iCONDOMINI!C82<>\"\",iCONDOMINI!C82,\"\")","v":""},"P.01.72"]
[null,{"$f":"IF(iCONDOMINI!C83<>\"\",iCONDOMINI!C83,\"\")","v":""},"P.01.73"]
[null,{"$f":"IF(iCONDOMINI!C84<>\"\",iCONDOMINI!C84,\"\")","v":""},"P.01.74"]
[null,{"$f":"IF(iCONDOMINI!C85<>\"\",iCONDOMINI!C85,\"\")","v":""},"P.01.75"]
[null,{"$f":"IF(iCONDOMINI!C86<>\"\",iCONDOMINI!C86,\"\")","v":""},"P.01.76"]
[null,{"$f":"IF(iCONDOMINI!C87<>\"\",iCONDOMINI!C87,\"\")","v":""},"P.01.77"]
[null,{"$f":"IF(iCONDOMINI!C88<>\"\",iCONDOMINI!C88,\"\")","v":""},"P.01.78"]
[null,{"$f":"IF(iCONDOMINI!C89<>\"\",iCONDOMINI!C89,\"\")","v":""},"P.01.79"]
[null,{"$f":"IF(iCONDOMINI!C90<>\"\",iCONDOMINI!C90,\"\")","v":""},"P.01.80"]
[null,{"$f":"IF(iCONDOMINI!C91<>\"\",iCONDOMINI!C91,\"\")","v":""},"P.01.81"]
[null,{"$f":"IF(iCONDOMINI!C92<>\"\",iCONDOMINI!C92,\"\")","v":""},"P.01.82"]
[null,{"$f":"IF(iCONDOMINI!C93<>\"\",iCONDOMINI!C93,\"\")","v":""},"P.01.83"]
[null,{"$f":"IF(iCONDOMINI!C94<>\"\",iCONDOMINI!C94,\"\")","v":""},"P.01.84"]
[null,{"$f":"IF(iCONDOMINI!C95<>\"\",iCONDOMINI!C95,\"\")","v":""},"P.01.85"]
[null,{"$f":"IF(iCONDOMINI!C96<>\"\",iCONDOMINI!C96,\"\")","v":""},"P.01.86"]
[null,{"$f":"IF(iCONDOMINI!C97<>\"\",iCONDOMINI!C97,\"\")","v":""},"P.01.87"]
[null,{"$f":"IF(iCONDOMINI!C98<>\"\",iCONDOMINI!C98,\"\")","v":""},"P.01.88"]
[null,{"$f":"IF(iCONDOMINI!C99<>\"\",iCONDOMINI!C99,\"\")","v":""},"P.01.89"]
[null,{"$f":"IF(iCONDOMINI!C100<>\"\",iCONDOMINI!C100,\"\")","v":""},"P.01.90"]
[null,{"$f":"IF(iCONDOMINI!C101<>\"\",iCONDOMINI!C101,\"\")","v":""},"P.01.91"]
[null,{"$f":"IF(iCONDOMINI!C102<>\"\",iCONDOMINI!C102,\"\")","v":""},"P.01.92"]
[null,{"$f":"IF(iCONDOMINI!C103<>\"\",iCONDOMINI!C103,\"\")","v":""},"P.01.93"]
[null,{"$f":"IF(iCONDOMINI!C104<>\"\",iCONDOMINI!C104,\"\")","v":""},"P.01.94"]
[null,{"$f":"IF(iCONDOMINI!C105<>\"\",iCONDOMINI!C105,\"\")","v":""},"P.01.95"]
[null,{"$f":"IF(iCONDOMINI!C106<>\"\",iCONDOMINI!C106,\"\")","v":""},"P.01.96"]
[null,{"$f":"IF(iCONDOMINI!C107<>\"\",iCONDOMINI!C107,\"\")","v":""},"P.01.97"]
[null,{"$f":"IF(iCONDOMINI!C108<>\"\",iCONDOMINI!C108,\"\")","v":""},"P.01.98"]
[null,{"$f":"IF(iCONDOMINI!C109<>\"\",iCONDOMINI!C109,\"\")","v":""},"P.01.99"]
[null,"RESTITUZIONI, RIMBORSI e PAGAMENTI DEBITI","U"]
[null,"Restituzioni a Condomini versamenti in eccesso per l'esercizio precedente","U.01.01.NC"]
[null,"Restituzione Prestiti","U.01.02"]
[null,"Pagamenti Debiti v/s  Terzi Privati, Erario e Enti Pubblici","U.01.03"]
[null,"Versamenti Ritenute d'Acconto relative a debiti esercizi precedenti ","U.01.04"]
[null,null,"U.01.05"]
[null,"PRESTITI A GESTIONI SPECIALI SEPARATE e FONDI","R"]
[null,{"$f":"IF(LEN(iDG!B87)>0,CONCATENATE(\"Prestito a GESTIONE SPECIALE  \",\"\"\"\",iDG!B87,\"\"\"\"),\"\")","v":"Prestito a GESTIONE SPECIALE  \"PROSPETTI\""},"R.01.01"]
[null,{"$f":"IF(LEN(iDG!B88)>0,CONCATENATE(\"Prestito a GESTIONE SPECIALE  \",\"\"\"\",iDG!B88,\"\"\"\"),\"\")","v":""},"R.01.02"]
[null,{"$f":"IF(LEN(iDG!B89)>0,CONCATENATE(\"Prestito a GESTIONE SPECIALE  \",\"\"\"\",iDG!B89,\"\"\"\"),\"\")","v":""},"R.01.03"]
[null,{"$f":"IF(LEN(iDG!B90)>0,CONCATENATE(\"Prestito a GESTIONE SPECIALE  \",\"\"\"\",iDG!B90,\"\"\"\"),\"\")","v":""},"R.01.04"]
[null,{"$f":"IF(LEN(iDG!B91)>0,CONCATENATE(\"Prestito a GESTIONE SPECIALE  \",\"\"\"\",iDG!B91,\"\"\"\"),\"\")","v":""},"R.01.05"]
[null,"USCITE PER CONTO DI GESTIONI SPECIALI SEPARATI e FONDI ","G"]
[null,{"$f":"IF(LEN(iDG!B87)>0,CONCATENATE(\"Uscite per conto di GESTIONE SPECIALE \", \"\"\"\",iDG!B87,\"\"\"\"),\"\")","v":"Uscite per conto di GESTIONE SPECIALE \"PROSPETTI\""},"G.01.01"]
[null,{"$f":"IF(LEN(iDG!B88)>0,CONCATENATE(\"Uscite per conto di GESTIONE SPECIALE \", \"\"\"\",iDG!B88,\"\"\"\"),\"\")","v":""},"G.01.02"]
[null,{"$f":"IF(LEN(iDG!B89)>0,CONCATENATE(\"Uscite per conto di GESTIONE SPECIALE \", \"\"\"\",iDG!B89,\"\"\"\"),\"\")","v":""},"G.01.03"]
[null,{"$f":"IF(LEN(iDG!B90)>0,CONCATENATE(\"Uscite per conto di GESTIONE SPECIALE \", \"\"\"\",iDG!B90,\"\"\"\"),\"\")","v":""},"G.01.04"]
[null,{"$f":"IF(LEN(iDG!B91)>0,CONCATENATE(\"Uscite per conto di GESTIONE SPECIALE \", \"\"\"\",iDG!B91,\"\"\"\"),\"\")","v":""},"G.01.05"]
[null,0,null,null,null,null,0]

{"sheet":"iPCE","index":7,"n_rows":166,"n_cols":6,"rows_kept":166,"cut":false,"hidden":true,"merged":[]}
[null,"È consentito variare i valori delle sole celle con sfondo bianco.",null,null,null,0]
[]
[]
[]
[null,{"$f":"iDG!B32","v":"Condominio Palazzo Duck"}]
[]
[null,"PIANO GENERALE DEI CONTI"]
[null,"PIANO DELLE RISCOSSIONI, DELLE ENTRATE E DEGLI INCASSI"]
[null,"SEZIONI, CAPITOLI e VOCI","CODICI CONTO"]
[null,"RISCOSSIONE CONTRIBUTI CONDOMINIALI (GESTIONE ORDINARIA)","Q.01\nQUOTE\nEsercizio\nin corso","Q.02\nCONGUAGLIO\nEsercizio\nprecedente","Q.03\nARRETRATI"]
[null,{"$f":"iCONDOMINI!C11","v":"Paperoga"},"Q.01.01","Q.02.01","Q.03.01"]
[null,{"$f":"iCONDOMINI!C12","v":"Ciccio"},"Q.01.02","Q.02.02","Q.03.02"]
[null,{"$f":"iCONDOMINI!C13","v":"Gastone"},"Q.01.03","Q.02.03","Q.03.03"]
[null,{"$f":"iCONDOMINI!C14","v":"I tre nipotini"},"Q.01.04","Q.02.04","Q.03.04"]
[null,{"$f":"iCONDOMINI!C15","v":"Nonna Papera"},"Q.01.05","Q.02.05","Q.03.05"]
[null,{"$f":"iCONDOMINI!C16","v":"Fidanzati Paperino-Paperina"},"Q.01.06","Q.02.06","Q.03.06"]
[null,{"$f":"iCONDOMINI!C17","v":0},"Q.01.07","Q.02.07","Q.03.07"]
[null,{"$f":"iCONDOMINI!C18","v":0},"Q.01.08","Q.02.08","Q.03.08"]
[null,{"$f":"iCONDOMINI!C19","v":0},"Q.01.09","Q.02.09","Q.03.09"]
[null,{"$f":"iCONDOMINI!C20","v":0},"Q.01.10","Q.02.10","Q.03.10"]
[null,{"$f":"iCONDOMINI!C21","v":0},"Q.01.11","Q.02.11","Q.03.11"]
[null,{"$f":"iCONDOMINI!C22","v":0},"Q.01.12","Q.02.12","Q.03.12"]
[null,{"$f":"iCONDOMINI!C23","v":0},"Q.01.13","Q.02.13","Q.03.13"]
[null,{"$f":"iCONDOMINI!C24","v":0},"Q.01.14","Q.02.14","Q.03.14"]
[null,{"$f":"iCONDOMINI!C25","v":0},"Q.01.15","Q.02.15","Q.03.15"]
[null,{"$f":"iCONDOMINI!C26","v":0},"Q.01.16","Q.02.16","Q.03.16"]
[null,{"$f":"iCONDOMINI!C27","v":0},"Q.01.17","Q.02.17","Q.03.17"]
[null,{"$f":"iCONDOMINI!C28","v":0},"Q.01.18","Q.02.18","Q.03.18"]
[null,{"$f":"iCONDOMINI!C29","v":0},"Q.01.19","Q.02.19","Q.03.19"]
[null,{"$f":"iCONDOMINI!C30","v":0},"Q.01.20","Q.02.20","Q.03.20"]
[null,{"$f":"iCONDOMINI!C31","v":0},"Q.01.21","Q.02.21","Q.03.21"]
[null,{"$f":"iCONDOMINI!C32","v":0},"Q.01.22","Q.02.22","Q.03.22"]
[null,{"$f":"iCONDOMINI!C33","v":0},"Q.01.23","Q.02.23","Q.03.23"]
[null,{"$f":"iCONDOMINI!C34","v":0},"Q.01.24","Q.02.24","Q.03.24"]
[null,{"$f":"iCONDOMINI!C35","v":0},"Q.01.25","Q.02.25","Q.03.25"]
[null,{"$f":"iCONDOMINI!C36","v":0},"Q.01.26","Q.02.26","Q.03.26"]
[null,{"$f":"iCONDOMINI!C37","v":0},"Q.01.27","Q.02.27","Q.03.27"]
[null,{"$f":"iCONDOMINI!C38","v":0},"Q.01.28","Q.02.28","Q.03.28"]
[null,{"$f":"iCONDOMINI!C39","v":0},"Q.01.29","Q.02.29","Q.03.29"]
[null,{"$f":"iCONDOMINI!C40","v":0},"Q.01.30","Q.02.30","Q.03.30"]
[null,{"$f":"iCONDOMINI!C41","v":0},"Q.01.31","Q.02.31","Q.03.31"]
[null,{"$f":"iCONDOMINI!C42","v":0},"Q.01.32","Q.02.32","Q.03.32"]
[null,{"$f":"iCONDOMINI!C43","v":0},"Q.01.33","Q.02.33","Q.03.33"]
[null,{"$f":"iCONDOMINI!C44","v":0},"Q.01.34","Q.02.34","Q.03.34"]
[null,{"$f":"iCONDOMINI!C45","v":0},"Q.01.35","Q.02.35","Q.03.35"]
[null,{"$f":"iCONDOMINI!C46","v":0},"Q.01.36","Q.02.36","Q.03.36"]
[null,{"$f":"iCONDOMINI!C47","v":0},"Q.01.37","Q.02.37","Q.03.37"]
[null,{"$f":"iCONDOMINI!C48","v":0},"Q.01.38","Q.02.38","Q.03.38"]
[null,{"$f":"iCONDOMINI!C49","v":0},"Q.01.39","Q.02.39","Q.03.39"]
[null,{"$f":"iCONDOMINI!C50","v":0},"Q.01.40","Q.02.40","Q.03.40"]
[null,{"$f":"iCONDOMINI!C51","v":0},"Q.01.41","Q.02.41","Q.03.41"]
[null,{"$f":"iCONDOMINI!C52","v":0},"Q.01.42","Q.02.42","Q.03.42"]
[null,{"$f":"iCONDOMINI!C53","v":0},"Q.01.43","Q.02.43","Q.03.43"]
[null,{"$f":"iCONDOMINI!C54","v":0},"Q.01.44","Q.02.44","Q.03.44"]
[null,{"$f":"iCONDOMINI!C55","v":0},"Q.01.45","Q.02.45","Q.03.45"]
[null,{"$f":"iCONDOMINI!C56","v":0},"Q.01.46","Q.02.46","Q.03.46"]
[null,{"$f":"iCONDOMINI!C57","v":0},"Q.01.47","Q.02.47","Q.03.47"]
[null,{"$f":"iCONDOMINI!C58","v":0},"Q.01.48","Q.02.48","Q.03.48"]
[null,{"$f":"iCONDOMINI!C59","v":0},"Q.01.49","Q.02.49","Q.03.49"]
[null,{"$f":"iCONDOMINI!C60","v":0},"Q.01.50","Q.02.50","Q.03.50"]
[null,{"$f":"iCONDOMINI!C61","v":0},"Q.01.51","Q.02.51","Q.03.51"]
[null,{"$f":"iCONDOMINI!C62","v":0},"Q.01.52","Q.02.52","Q.03.52"]
[null,{"$f":"iCONDOMINI!C63","v":0},"Q.01.53","Q.02.53","Q.03.53"]
[null,{"$f":"iCONDOMINI!C64","v":0},"Q.01.54","Q.02.54","Q.03.54"]
[null,{"$f":"iCONDOMINI!C65","v":0},"Q.01.55","Q.02.55","Q.03.55"]
[null,{"$f":"iCONDOMINI!C66","v":0},"Q.01.56","Q.02.56","Q.03.56"]
[null,{"$f":"iCONDOMINI!C67","v":0},"Q.01.57","Q.02.57","Q.03.57"]
[null,{"$f":"iCONDOMINI!C68","v":0},"Q.01.58","Q.02.58","Q.03.58"]
[null,{"$f":"iCONDOMINI!C69","v":0},"Q.01.59","Q.02.59","Q.03.59"]
[null,{"$f":"iCONDOMINI!C70","v":0},"Q.01.60","Q.02.60","Q.03.60"]
[null,{"$f":"iCONDOMINI!C71","v":0},"Q.01.61","Q.02.61","Q.03.61"]
[null,{"$f":"iCONDOMINI!C72","v":0},"Q.01.62","Q.02.62","Q.03.62"]
[null,{"$f":"iCONDOMINI!C73","v":0},"Q.01.63","Q.02.63","Q.03.63"]
[null,{"$f":"iCONDOMINI!C74","v":0},"Q.01.64","Q.02.64","Q.03.64"]
[null,{"$f":"iCONDOMINI!C75","v":0},"Q.01.65","Q.02.65","Q.03.65"]
[null,{"$f":"iCONDOMINI!C76","v":0},"Q.01.66","Q.02.66","Q.03.66"]
[null,{"$f":"iCONDOMINI!C77","v":0},"Q.01.67","Q.02.67","Q.03.67"]
[null,{"$f":"iCONDOMINI!C78","v":0},"Q.01.68","Q.02.68","Q.03.68"]
[null,{"$f":"iCONDOMINI!C79","v":0},"Q.01.69","Q.02.69","Q.03.69"]
[null,{"$f":"iCONDOMINI!C80","v":0},"Q.01.70","Q.02.70","Q.03.70"]
[null,{"$f":"iCONDOMINI!C81","v":0},"Q.01.71","Q.02.71","Q.03.71"]
[null,{"$f":"iCONDOMINI!C82","v":0},"Q.01.72","Q.02.72","Q.03.72"]
[null,{"$f":"iCONDOMINI!C83","v":0},"Q.01.73","Q.02.73","Q.03.73"]
[null,{"$f":"iCONDOMINI!C84","v":0},"Q.01.74","Q.02.74","Q.03.74"]
[null,{"$f":"iCONDOMINI!C85","v":0},"Q.01.75","Q.02.75","Q.03.75"]
[null,{"$f":"iCONDOMINI!C86","v":0},"Q.01.76","Q.02.76","Q.03.76"]
[null,{"$f":"iCONDOMINI!C87","v":0},"Q.01.77","Q.02.77","Q.03.77"]
[null,{"$f":"iCONDOMINI!C88","v":0},"Q.01.78","Q.02.78","Q.03.78"]
[null,{"$f":"iCONDOMINI!C89","v":0},"Q.01.79","Q.02.79","Q.03.79"]
[null,{"$f":"iCONDOMINI!C90","v":0},"Q.01.80","Q.02.80","Q.03.80"]
[null,{"$f":"iCONDOMINI!C91","v":0},"Q.01.81","Q.02.81","Q.03.81"]
[null,{"$f":"iCONDOMINI!C92","v":0},"Q.01.82","Q.02.82","Q.03.82"]
[null,{"$f":"iCONDOMINI!C93","v":0},"Q.01.83","Q.02.83","Q.03.83"]
[null,{"$f":"iCONDOMINI!C94","v":0},"Q.01.84","Q.02.84","Q.03.84"]
[null,{"$f":"iCONDOMINI!C95","v":0},"Q.01.85","Q.02.85","Q.03.85"]
[null,{"$f":"iCONDOMINI!C96","v":0},"Q.01.86","Q.02.86","Q.03.86"]
[null,{"$f":"iCONDOMINI!C97","v":0},"Q.01.87","Q.02.87","Q.03.87"]
[null,{"$f":"iCONDOMINI!C98","v":0},"Q.01.88","Q.02.88","Q.03.88"]
[null,{"$f":"iCONDOMINI!C99","v":0},"Q.01.89","Q.02.89","Q.03.89"]
[null,{"$f":"iCONDOMINI!C100","v":0},"Q.01.90","Q.02.90","Q.03.90"]
[null,{"$f":"iCONDOMINI!C101","v":0},"Q.01.91","Q.02.91","Q.03.91"]
[null,{"$f":"iCONDOMINI!C102","v":0},"Q.01.92","Q.02.92","Q.03.92"]
[null,{"$f":"iCONDOMINI!C103","v":0},"Q.01.93","Q.02.93","Q.03.93"]
[null,{"$f":"iCONDOMINI!C104","v":0},"Q.01.94","Q.02.94","Q.03.94"]
[null,{"$f":"iCONDOMINI!C105","v":0},"Q.01.95","Q.02.95","Q.03.95"]
[null,{"$f":"iCONDOMINI!C106","v":0},"Q.01.96","Q.02.96","Q.03.96"]
[null,{"$f":"iCONDOMINI!C107","v":0},"Q.01.97","Q.02.97","Q.03.97"]
[null,{"$f":"iCONDOMINI!C108","v":0},"Q.01.98","Q.02.98","Q.03.98"]
[null,{"$f":"iCONDOMINI!C109","v":0},"Q.01.99","Q.02.99","Q.03.99"]
[null,"ABBUONI SU SPESE GESTIONE ORDINARIA","A"]
[null,{"$f":"IF(iDG!B52<>\"\",TRIM(\"Abbuoni su spese già ripartite con \" &iDG!D52),\"\")","v":"Abbuoni su spese già ripartite con Tabella A"},"A.01.01"]
[null,{"$f":"IF(iDG!B53<>\"\",TRIM(\"Abbuoni su spese già ripartite con \" &iDG!D53),\"\")","v":"Abbuoni su spese già ripartite con Tabella B"},"A.01.02"]
[null,{"$f":"IF(iDG!B54<>\"\",TRIM(\"Abbuoni su spese già ripartite con \" &iDG!D54),\"\")","v":"Abbuoni su spese già ripartite con Tabella C"},"A.01.03"]
[null,{"$f":"IF(iDG!B55<>\"\",TRIM(\"Abbuoni su spese già ripartite con \" &iDG!D55),\"\")","v":"Abbuoni su spese già ripartite con Tabella D"},"A.01.04"]
[null,{"$f":"IF(iDG!B56<>\"\",TRIM(\"Abbuoni su spese già ripartite con \" &iDG!D56),\"\")","v":"Abbuoni su spese già ripartite con Tabella E"},"A.01.05"]
[null,{"$f":"IF(iDG!B57<>\"\",TRIM(\"Abbuoni su spese già ripartite con \" &iDG!D57),\"\")","v":""},"A.01.06"]
[null,{"$f":"IF(iDG!B58<>\"\",TRIM(\"Abbuoni su spese già ripartite con \" &iDG!D58),\"\")","v":""},"A.01.07"]
[null,{"$f":"IF(iDG!B59<>\"\",TRIM(\"Abbuoni su spese già ripartite con \" &iDG!D59),\"\")","v":""},"A.01.08"]
[null,{"$f":"IF(iDG!B60<>\"\",TRIM(\"Abbuoni su spese già ripartite con \" &iDG!D60),\"\")","v":""},"A.01.09"]
[null,{"$f":"IF(iDG!B61<>\"\",TRIM(\"Abbuoni su spese già ripartite con \" &iDG!D61),\"\")","v":""},"A.01.10"]
[null,"RENDITE e PROVENTI DIVERSI\n(Queste Entrate saranno ripartire fra i condomini secondo la tabella A)","E"]
[null,"Proventi da Sanzioni a condomini","E.01.01"]
[null,"Rendite Patrimoniali da beni comuni censibili (fitti, ...)","E.01.02"]
[null,"Rendite Finanziarie (interessi attivi, ...)","E.01.03"]
[null,"Donazioni ricevute dal Condominio","E.01.04"]
[null,"Proventi da Attività commerciali e produttive marginali","E.01.05"]
[null,"Entrate varie","E.01.06"]
[null,null,"E.01.07"]
[null,null,"E.01.08"]
[null,null,"E.01.09"]
[null,null,"E.01.10"]
[null,"RISCOSSIONE QUOTE (GESTIONI SPECIALI SEPARATE o FONDI)","F"]
[null,{"$f":"IF(LEN(iDG!B87)>0,CONCATENATE(\"Riscossione su cassa di quote della GESTIONE SPECIALE \",\"\"\"\",iDG!B87,\"\"\"\"),\"\")","v":"Riscossione su cassa di quote della GESTIONE SPECIALE \"PROSPETTI\""},"F.01.01"]
[null,{"$f":"IF(LEN(iDG!B87)>0,CONCATENATE(\"Riscossione su conto corrente di quote della GESTIONE SPECIALE \",\"\"\"\", iDG!B87,\"\"\"\"),\"\")","v":"Riscossione su conto corrente di quote della GESTIONE SPECIALE \"PROSPETTI\""},"F.01.02"]
[null,{"$f":"IF(LEN(iDG!B88)>0,CONCATENATE(\"Riscossione su cassa di quote della GESTIONE SPECIALE \",\"\"\"\",iDG!B88,\"\"\"\"),\"\")","v":""},"F.02.01"]
[null,{"$f":"IF(LEN(iDG!B88)>0,CONCATENATE(\"Riscossione su conto corrente di quote della GESTIONE SPECIALE \",\"\"\"\", iDG!B88,\"\"\"\"),\"\")","v":""},"F.02.02"]
[null,{"$f":"IF(LEN(iDG!B89)>0,CONCATENATE(\"Riscossione su cassa di quote della GESTIONE SPECIALE  \",\"\"\"\",iDG!B89,\"\"\"\"),\"\")","v":""},"F.03.01"]
[null,{"$f":"IF(LEN(iDG!B89)>0,CONCATENATE(\"Riscossione su conto corrente di quote della GESTIONE SPECIALE \",\"\"\"\", iDG!B89,\"\"\"\"),\"\")","v":""},"F.03.02"]
[null,{"$f":"IF(LEN(iDG!B90)>0,CONCATENATE(\"Riscossione su cassa di quote della GESTIONE SPECIALE \",\"\"\"\",iDG!B90,\"\"\"\"),\"\")","v":""},"F.04.01"]
[null,{"$f":"IF(LEN(iDG!B90)>0,CONCATENATE(\"Riscossione su conto corrente di quote della GESTIONE SPECIALE \",\"\"\"\", iDG!B90,\"\"\"\"),\"\")","v":""},"F.04.02"]
[null,{"$f":"IF(LEN(iDG!B91)>0,CONCATENATE(\"Riscossione su cassa di quote della GESTIONE SPECIALE \",\"\"\"\",iDG!B91,\"\"\"\"),\"\")","v":""},"F.05.01"]
[null,{"$f":"IF(LEN(iDG!B91)>0,CONCATENATE(\"Riscossione su conto corrente di quote della GESTIONE SPECIALE \",\"\"\"\", iDG!B91,\"\"\"\"),\"\")","v":""},"F.05.02"]
[null,"FINANZIAMENTI RICEVUTI IN PRESTITO e ALTRE PARTITE DI GIRO","V"]
[null,"Anticipazione di cassa da Amministratore","V.01.01"]
[null,"Prestiti ricevuti da terzi","V.01.02"]
[null,null,"V.01.03"]
[null,null,"V.01.04"]
[null,null,"V.01.05"]
[null,"FINANZIAMENTI ALLA GESTIONE ORDINARIA IN PRESTITO da GESTIONI SPECIALI","W"]
[null,{"$f":"IF(LEN(iDG!B87)>0,CONCATENATE(\"Finanziamento in prestito dalla GESTIONE SPECIALE  \",\"\"\"\",iDG!B87,\"\"\"\"),\"\")","v":"Finanziamento in prestito dalla GESTIONE SPECIALE  \"PROSPETTI\""},"W.01.01"]
[null,{"$f":"IF(LEN(iDG!B88)>0,CONCATENATE(\"Finanziamento in prestito dalla GESTIONE SPECIALE  \",\"\"\"\",iDG!B88,\"\"\"\"),\"\")","v":""},"W.01.02"]
[null,{"$f":"IF(LEN(iDG!B89)>0,CONCATENATE(\"Finanziamento in prestito dalla GESTIONE SPECIALE  \",\"\"\"\",iDG!B89,\"\"\"\"),\"\")","v":""},"W.01.03"]
[null,{"$f":"IF(LEN(iDG!B90)>0,CONCATENATE(\"Finanziamento in prestito dalla GESTIONE SPECIALE  \",\"\"\"\",iDG!B90,\"\"\"\"),\"\")","v":""},"W.01.04"]
[null,{"$f":"IF(LEN(iDG!B91)>0,CONCATENATE(\"Finanziamento in prestito dalla GESTIONE SPECIALE  \",\"\"\"\",iDG!B91,\"\"\"\"),\"\")","v":""},"W.01.05"]
[null,"ENTRATE VARIE e RESTITUZIONI SU SPESE GIÀ RIPARTITE IN ESERCIZI PRECEDENTI","K"]
[null,{"$f":"IF(iDG!B52<>\"\",TRIM(\"Entrate da ripartire con \" &iDG!D52),\"\")","v":"Entrate da ripartire con Tabella A"},"K.01.01"]
[null,{"$f":"IF(iDG!B53<>\"\",TRIM(\"Entrate da ripartire con \" &iDG!D53),\"\")","v":"Entrate da ripartire con Tabella B"},"K.01.02"]
[null,{"$f":"IF(iDG!B54<>\"\",TRIM(\"Entrate da ripartire con \" &iDG!D54),\"\")","v":"Entrate da ripartire con Tabella C"},"K.01.03"]
[null,{"$f":"IF(iDG!B55<>\"\",TRIM(\"Entrate da ripartire con \" &iDG!D55),\"\")","v":"Entrate da ripartire con Tabella D"},"K.01.04"]
[null,{"$f":"IF(iDG!B56<>\"\",TRIM(\"Entrate da ripartire con \" &iDG!D56),\"\")","v":"Entrate da ripartire con Tabella E"},"K.01.05"]
[null,{"$f":"IF(iDG!B57<>\"\",TRIM(\"Entrate da ripartire con \" &iDG!D57),\"\")","v":""},"K.01.06"]
[null,{"$f":"IF(iDG!B58<>\"\",TRIM(\"Entrate da ripartire con \" &iDG!D58),\"\")","v":""},"K.01.07"]
[null,{"$f":"IF(iDG!B59<>\"\",TRIM(\"Entrate da ripartire con \" &iDG!D59),\"\")","v":""},"K.01.08"]
[null,{"$f":"IF(iDG!B60<>\"\",TRIM(\"Entrate da ripartire con \" &iDG!D60),\"\")","v":""},"K.01.09"]
[null,{"$f":"IF(iDG!B61<>\"\",TRIM(\"Entrate da ripartire con \" &iDG!D61),\"\")","v":""},"K.01.10"]
[null,0,null,null,null,0]

{"sheet":"iPCDC","index":8,"n_rows":135,"n_cols":8,"rows_kept":135,"cut":false,"hidden":true,"merged":[]}
[null,"È consentito variare i valori delle sole celle con sfondo bianco.",null,null,null,null,null,0]
[]
[]
[]
[null,{"$f":"iDG!B32","v":"Condominio Palazzo Duck"}]
[]
[]
[null,"PIANO GENERALE DEI CONTI"]
[null,"PIANO DEI CREDITI",null,null,"PIANO DEI DEBITI"]
[null,"CAPITOLI e VOCI","CODICE CONTO",null,"CAPITOLI e VOCI","CODICI CONTO"]
[null,"da DEPOSITI di DENARO presso Terzi","C.01"]
[null,{"$f":"iPCU!B84","v":"DEPOSITI CAUZIONALI"},"C.01.01.YY"]
[null,{"$f":"iPCU!B85","v":"ACQUISTO VOUCHER LAVORI"},"C.01.02.YY"]
[null,{"$f":"iPCU!B86","v":"PRESTITI A TERZI"},"C.01.03.YY"]
[null,{"$f":"iPCU!B87","v":0},"C.01.04.YY",null,{"$f":"B15","v":0}]
[null,{"$f":"iPCU!B88","v":0},"C.01.05.YY",null,{"$f":"B16","v":0}]
[null,"da TERZI PRIVATI","C.02",null,"v/s TERZI PRIVATI","D.02"]
[null,"da FORNITORI","C.02.01.YY",null,"v/s FORNITORI per FATTURE RICEVUTE","D.02.01.YY"]
[null,"da DEBITORI DIVERSI","C.02.02.YY",null,"v/s FORNITORI per AVVISI DI FATTURA RICEVUTI","D.02.02.YY"]
[null,"da CANONI e FITTI","C.02.03.YY",null,"v/s FORNITORI per IMPEGNI DI SPESA","D.02.03.YY"]
[null,null,"C.02.04.YY",null,"v/s TERZI per PRESTITI RICEVUTI","D.02.04.YY"]
[null,null,"C.02.05.YY",null,"v/s CREDITORI DIVERSI","D.02.05.YY"]
[null,"da TERZI PUBBLICI","C.03",null,"v/s TERZI PUBBLICI","D.03"]
[null,"da ERARIO","C.03.01.YY",null,"v/s ERARIO  per RITENUTE  ACCONTO SU SPESE","D.03.01.YY"]
[null,"da altri Enti Pubblici","C.03.02.YY",null,"v/s ERARIO per TRIBUTI","D.03.02.YY"]
[null,null,"C.03.03.YY",null,"v/s ERARIO  per R.A. SU PAGAMENTI DEBITI","D.03.03.YY"]
[null,null,"C.03.04.YY",null,"v/s ENTI PUBBLICI per Tributi e Tasse","D.03.04.YY"]
[null,null,"C.03.05.YY",null,null,"D.03.05.YY"]
[null,"da CONDOMINI","C.04",null,"v/s CONDOMINI","D.04","D.05"]
[null,{"$f":"iCONDOMINI!C11","v":"Paperoga"},"C.04.01.YY",null,{"$f":"iCONDOMINI!C11","v":"Paperoga"},"D.04.01","D.05.01"]
[null,{"$f":"iCONDOMINI!C12","v":"Ciccio"},"C.04.02.YY",null,{"$f":"iCONDOMINI!C12","v":"Ciccio"},"D.04.02","D.05.02"]
[null,{"$f":"iCONDOMINI!C13","v":"Gastone"},"C.04.03.YY",null,{"$f":"iCONDOMINI!C13","v":"Gastone"},"D.04.03","D.05.03"]
[null,{"$f":"iCONDOMINI!C14","v":"I tre nipotini"},"C.04.04.YY",null,{"$f":"iCONDOMINI!C14","v":"I tre nipotini"},"D.04.04","D.05.04"]
[null,{"$f":"iCONDOMINI!C15","v":"Nonna Papera"},"C.04.05.YY",null,{"$f":"iCONDOMINI!C15","v":"Nonna Papera"},"D.04.05","D.05.05"]
[null,{"$f":"iCONDOMINI!C16","v":"Fidanzati Paperino-Paperina"},"C.04.06.YY",null,{"$f":"iCONDOMINI!C16","v":"Fidanzati Paperino-Paperina"},"D.04.06","D.05.06"]
[null,{"$f":"iCONDOMINI!C17","v":0},"C.04.07.YY",null,{"$f":"iCONDOMINI!C17","v":0},"D.04.07","D.05.07"]
[null,{"$f":"iCONDOMINI!C18","v":0},"C.04.08.YY",null,{"$f":"iCONDOMINI!C18","v":0},"D.04.08","D.05.08"]
[null,{"$f":"iCONDOMINI!C19","v":0},"C.04.09.YY",null,{"$f":"iCONDOMINI!C19","v":0},"D.04.09","D.05.09"]
[null,{"$f":"iCONDOMINI!C20","v":0},"C.04.10.YY",null,{"$f":"iCONDOMINI!C20","v":0},"D.04.10","D.05.10"]
[null,{"$f":"iCONDOMINI!C21","v":0},"C.04.11.YY",null,{"$f":"iCONDOMINI!C21","v":0},"D.04.11","D.05.11"]
[null,{"$f":"iCONDOMINI!C22","v":0},"C.04.12.YY",null,{"$f":"iCONDOMINI!C22","v":0},"D.04.12","D.05.12"]
[null,{"$f":"iCONDOMINI!C23","v":0},"C.04.13.YY",null,{"$f":"iCONDOMINI!C23","v":0},"D.04.13","D.05.13"]
[null,{"$f":"iCONDOMINI!C24","v":0},"C.04.14.YY",null,{"$f":"iCONDOMINI!C24","v":0},"D.04.14","D.05.14"]
[null,{"$f":"iCONDOMINI!C25","v":0},"C.04.15.YY",null,{"$f":"iCONDOMINI!C25","v":0},"D.04.15","D.05.15"]
[null,{"$f":"iCONDOMINI!C26","v":0},"C.04.16.YY",null,{"$f":"iCONDOMINI!C26","v":0},"D.04.16","D.05.16"]
[null,{"$f":"iCONDOMINI!C27","v":0},"C.04.17.YY",null,{"$f":"iCONDOMINI!C27","v":0},"D.04.17","D.05.17"]
[null,{"$f":"iCONDOMINI!C28","v":0},"C.04.18.YY",null,{"$f":"iCONDOMINI!C28","v":0},"D.04.18","D.05.18"]
[null,{"$f":"iCONDOMINI!C29","v":0},"C.04.19.YY",null,{"$f":"iCONDOMINI!C29","v":0},"D.04.19","D.05.19"]
[null,{"$f":"iCONDOMINI!C30","v":0},"C.04.20.YY",null,{"$f":"iCONDOMINI!C30","v":0},"D.04.20","D.05.20"]
[null,{"$f":"iCONDOMINI!C31","v":0},"C.04.21.YY",null,{"$f":"iCONDOMINI!C31","v":0},"D.04.21","D.05.21"]
[null,{"$f":"iCONDOMINI!C32","v":0},"C.04.22.YY",null,{"$f":"iCONDOMINI!C32","v":0},"D.04.22","D.05.22"]
[null,{"$f":"iCONDOMINI!C33","v":0},"C.04.23.YY",null,{"$f":"iCONDOMINI!C33","v":0},"D.04.23","D.05.23"]
[null,{"$f":"iCONDOMINI!C34","v":0},"C.04.24.YY",null,{"$f":"iCONDOMINI!C34","v":0},"D.04.24","D.05.24"]
[null,{"$f":"iCONDOMINI!C35","v":0},"C.04.25.YY",null,{"$f":"iCONDOMINI!C35","v":0},"D.04.25","D.05.25"]
[null,{"$f":"iCONDOMINI!C36","v":0},"C.04.26.YY",null,{"$f":"iCONDOMINI!C36","v":0},"D.04.26","D.05.26"]
[null,{"$f":"iCONDOMINI!C37","v":0},"C.04.27.YY",null,{"$f":"iCONDOMINI!C37","v":0},"D.04.27","D.05.27"]
[null,{"$f":"iCONDOMINI!C38","v":0},"C.04.28.YY",null,{"$f":"iCONDOMINI!C38","v":0},"D.04.28","D.05.28"]
[null,{"$f":"iCONDOMINI!C39","v":0},"C.04.29.YY",null,{"$f":"iCONDOMINI!C39","v":0},"D.04.29","D.05.29"]
[null,{"$f":"iCONDOMINI!C40","v":0},"C.04.30.YY",null,{"$f":"iCONDOMINI!C40","v":0},"D.04.30","D.05.30"]
[null,{"$f":"iCONDOMINI!C41","v":0},"C.04.31.YY",null,{"$f":"iCONDOMINI!C41","v":0},"D.04.31","D.05.31"]
[null,{"$f":"iCONDOMINI!C42","v":0},"C.04.32.YY",null,{"$f":"iCONDOMINI!C42","v":0},"D.04.32","D.05.32"]
[null,{"$f":"iCONDOMINI!C43","v":0},"C.04.33.YY",null,{"$f":"iCONDOMINI!C43","v":0},"D.04.33","D.05.33"]
[null,{"$f":"iCONDOMINI!C44","v":0},"C.04.34.YY",null,{"$f":"iCONDOMINI!C44","v":0},"D.04.34","D.05.34"]
[null,{"$f":"iCONDOMINI!C45","v":0},"C.04.35.YY",null,{"$f":"iCONDOMINI!C45","v":0},"D.04.35","D.05.35"]
[null,{"$f":"iCONDOMINI!C46","v":0},"C.04.36.YY",null,{"$f":"iCONDOMINI!C46","v":0},"D.04.36","D.05.36"]
[null,{"$f":"iCONDOMINI!C47","v":0},"C.04.37.YY",null,{"$f":"iCONDOMINI!C47","v":0},"D.04.37","D.05.37"]
[null,{"$f":"iCONDOMINI!C48","v":0},"C.04.38.YY",null,{"$f":"iCONDOMINI!C48","v":0},"D.04.38","D.05.38"]
[null,{"$f":"iCONDOMINI!C49","v":0},"C.04.39.YY",null,{"$f":"iCONDOMINI!C49","v":0},"D.04.39","D.05.39"]
[null,{"$f":"iCONDOMINI!C50","v":0},"C.04.40.YY",null,{"$f":"iCONDOMINI!C50","v":0},"D.04.40","D.05.40"]
[null,{"$f":"iCONDOMINI!C51","v":0},"C.04.41.YY",null,{"$f":"iCONDOMINI!C51","v":0},"D.04.41","D.05.41"]
[null,{"$f":"iCONDOMINI!C52","v":0},"C.04.42.YY",null,{"$f":"iCONDOMINI!C52","v":0},"D.04.42","D.05.42"]
[null,{"$f":"iCONDOMINI!C53","v":0},"C.04.43.YY",null,{"$f":"iCONDOMINI!C53","v":0},"D.04.43","D.05.43"]
[null,{"$f":"iCONDOMINI!C54","v":0},"C.04.44.YY",null,{"$f":"iCONDOMINI!C54","v":0},"D.04.44","D.05.44"]
[null,{"$f":"iCONDOMINI!C55","v":0},"C.04.45.YY",null,{"$f":"iCONDOMINI!C55","v":0},"D.04.45","D.05.45"]
[null,{"$f":"iCONDOMINI!C56","v":0},"C.04.46.YY",null,{"$f":"iCONDOMINI!C56","v":0},"D.04.46","D.05.46"]
[null,{"$f":"iCONDOMINI!C57","v":0},"C.04.47.YY",null,{"$f":"iCONDOMINI!C57","v":0},"D.04.47","D.05.47"]
[null,{"$f":"iCONDOMINI!C58","v":0},"C.04.48.YY",null,{"$f":"iCONDOMINI!C58","v":0},"D.04.48","D.05.48"]
[null,{"$f":"iCONDOMINI!C59","v":0},"C.04.49.YY",null,{"$f":"iCONDOMINI!C59","v":0},"D.04.49","D.05.49"]
[null,{"$f":"iCONDOMINI!C60","v":0},"C.04.50.YY",null,{"$f":"iCONDOMINI!C60","v":0},"D.04.50","D.05.50"]
[null,{"$f":"iCONDOMINI!C61","v":0},"C.04.51.YY",null,{"$f":"iCONDOMINI!C61","v":0},"D.04.51","D.05.51"]
[null,{"$f":"iCONDOMINI!C62","v":0},"C.04.52.YY",null,{"$f":"iCONDOMINI!C62","v":0},"D.04.52","D.05.52"]
[null,{"$f":"iCONDOMINI!C63","v":0},"C.04.53.YY",null,{"$f":"iCONDOMINI!C63","v":0},"D.04.53","D.05.53"]
[null,{"$f":"iCONDOMINI!C64","v":0},"C.04.54.YY",null,{"$f":"iCONDOMINI!C64","v":0},"D.04.54","D.05.54"]
[null,{"$f":"iCONDOMINI!C65","v":0},"C.04.55.YY",null,{"$f":"iCONDOMINI!C65","v":0},"D.04.55","D.05.55"]
[null,{"$f":"iCONDOMINI!C66","v":0},"C.04.56.YY",null,{"$f":"iCONDOMINI!C66","v":0},"D.04.56","D.05.56"]
[null,{"$f":"iCONDOMINI!C67","v":0},"C.04.57.YY",null,{"$f":"iCONDOMINI!C67","v":0},"D.04.57","D.05.57"]
[null,{"$f":"iCONDOMINI!C68","v":0},"C.04.58.YY",null,{"$f":"iCONDOMINI!C68","v":0},"D.04.58","D.05.58"]
[null,{"$f":"iCONDOMINI!C69","v":0},"C.04.59.YY",null,{"$f":"iCONDOMINI!C69","v":0},"D.04.59","D.05.59"]
[null,{"$f":"iCONDOMINI!C70","v":0},"C.04.60.YY",null,{"$f":"iCONDOMINI!C70","v":0},"D.04.60","D.05.60"]
[null,{"$f":"iCONDOMINI!C71","v":0},"C.04.61.YY",null,{"$f":"iCONDOMINI!C71","v":0},"D.04.61","D.05.61"]
[null,{"$f":"iCONDOMINI!C72","v":0},"C.04.62.YY",null,{"$f":"iCONDOMINI!C72","v":0},"D.04.62","D.05.62"]
[null,{"$f":"iCONDOMINI!C73","v":0},"C.04.63.YY",null,{"$f":"iCONDOMINI!C73","v":0},"D.04.63","D.05.63"]
[null,{"$f":"iCONDOMINI!C74","v":0},"C.04.64.YY",null,{"$f":"iCONDOMINI!C74","v":0},"D.04.64","D.05.64"]
[null,{"$f":"iCONDOMINI!C75","v":0},"C.04.65.YY",null,{"$f":"iCONDOMINI!C75","v":0},"D.04.65","D.05.65"]
[null,{"$f":"iCONDOMINI!C76","v":0},"C.04.66.YY",null,{"$f":"iCONDOMINI!C76","v":0},"D.04.66","D.05.66"]
[null,{"$f":"iCONDOMINI!C77","v":0},"C.04.67.YY",null,{"$f":"iCONDOMINI!C77","v":0},"D.04.67","D.05.67"]
[null,{"$f":"iCONDOMINI!C78","v":0},"C.04.68.YY",null,{"$f":"iCONDOMINI!C78","v":0},"D.04.68","D.05.68"]
[null,{"$f":"iCONDOMINI!C79","v":0},"C.04.69.YY",null,{"$f":"iCONDOMINI!C79","v":0},"D.04.69","D.05.69"]
[null,{"$f":"iCONDOMINI!C80","v":0},"C.04.70.YY",null,{"$f":"iCONDOMINI!C80","v":0},"D.04.70","D.05.70"]
[null,{"$f":"iCONDOMINI!C81","v":0},"C.04.71.YY",null,{"$f":"iCONDOMINI!C81","v":0},"D.04.71","D.05.71"]
[null,{"$f":"iCONDOMINI!C82","v":0},"C.04.72.YY",null,{"$f":"iCONDOMINI!C82","v":0},"D.04.72","D.05.72"]
[null,{"$f":"iCONDOMINI!C83","v":0},"C.04.73.YY",null,{"$f":"iCONDOMINI!C83","v":0},"D.04.73","D.05.73"]
[null,{"$f":"iCONDOMINI!C84","v":0},"C.04.74.YY",null,{"$f":"iCONDOMINI!C84","v":0},"D.04.74","D.05.74"]
[null,{"$f":"iCONDOMINI!C85","v":0},"C.04.75.YY",null,{"$f":"iCONDOMINI!C85","v":0},"D.04.75","D.05.75"]
[null,{"$f":"iCONDOMINI!C86","v":0},"C.04.76.YY",null,{"$f":"iCONDOMINI!C86","v":0},"D.04.76","D.05.76"]
[null,{"$f":"iCONDOMINI!C87","v":0},"C.04.77.YY",null,{"$f":"iCONDOMINI!C87","v":0},"D.04.77","D.05.77"]
[null,{"$f":"iCONDOMINI!C88","v":0},"C.04.78.YY",null,{"$f":"iCONDOMINI!C88","v":0},"D.04.78","D.05.78"]
[null,{"$f":"iCONDOMINI!C89","v":0},"C.04.79.YY",null,{"$f":"iCONDOMINI!C89","v":0},"D.04.79","D.05.79"]
[null,{"$f":"iCONDOMINI!C90","v":0},"C.04.80.YY",null,{"$f":"iCONDOMINI!C90","v":0},"D.04.80","D.05.80"]
[null,{"$f":"iCONDOMINI!C91","v":0},"C.04.81.YY",null,{"$f":"iCONDOMINI!C91","v":0},"D.04.81","D.05.81"]
[null,{"$f":"iCONDOMINI!C92","v":0},"C.04.82.YY",null,{"$f":"iCONDOMINI!C92","v":0},"D.04.82","D.05.82"]
[null,{"$f":"iCONDOMINI!C93","v":0},"C.04.83.YY",null,{"$f":"iCONDOMINI!C93","v":0},"D.04.83","D.05.83"]
[null,{"$f":"iCONDOMINI!C94","v":0},"C.04.84.YY",null,{"$f":"iCONDOMINI!C94","v":0},"D.04.84","D.05.84"]
[null,{"$f":"iCONDOMINI!C95","v":0},"C.04.85.YY",null,{"$f":"iCONDOMINI!C95","v":0},"D.04.85","D.05.85"]
[null,{"$f":"iCONDOMINI!C96","v":0},"C.04.86.YY",null,{"$f":"iCONDOMINI!C96","v":0},"D.04.86","D.05.86"]
[null,{"$f":"iCONDOMINI!C97","v":0},"C.04.87.YY",null,{"$f":"iCONDOMINI!C97","v":0},"D.04.87","D.05.87"]
[null,{"$f":"iCONDOMINI!C98","v":0},"C.04.88.YY",null,{"$f":"iCONDOMINI!C98","v":0},"D.04.88","D.05.88"]
[null,{"$f":"iCONDOMINI!C99","v":0},"C.04.89.YY",null,{"$f":"iCONDOMINI!C99","v":0},"D.04.89","D.05.89"]
[null,{"$f":"iCONDOMINI!C100","v":0},"C.04.90.YY",null,{"$f":"iCONDOMINI!C100","v":0},"D.04.90","D.05.90"]
[null,{"$f":"iCONDOMINI!C101","v":0},"C.04.91.YY",null,{"$f":"iCONDOMINI!C101","v":0},"D.04.91","D.05.91"]
[null,{"$f":"iCONDOMINI!C102","v":0},"C.04.92.YY",null,{"$f":"iCONDOMINI!C102","v":0},"D.04.92","D.05.92"]
[null,{"$f":"iCONDOMINI!C103","v":0},"C.04.93.YY",null,{"$f":"iCONDOMINI!C103","v":0},"D.04.93","D.05.93"]
[null,{"$f":"iCONDOMINI!C104","v":0},"C.04.94.YY",null,{"$f":"iCONDOMINI!C104","v":0},"D.04.94","D.05.94"]
[null,{"$f":"iCONDOMINI!C105","v":0},"C.04.95.YY",null,{"$f":"iCONDOMINI!C105","v":0},"D.04.95","D.05.95"]
[null,{"$f":"iCONDOMINI!C106","v":0},"C.04.96.YY",null,{"$f":"iCONDOMINI!C106","v":0},"D.04.96","D.05.96"]
[null,{"$f":"iCONDOMINI!C107","v":0},"C.04.97.YY",null,{"$f":"iCONDOMINI!C107","v":0},"D.04.97","D.05.97"]
[null,{"$f":"iCONDOMINI!C108","v":0},"C.04.98.YY",null,{"$f":"iCONDOMINI!C108","v":0},"D.04.98","D.05.98"]
[null,{"$f":"iCONDOMINI!C109","v":0},"C.04.99.YY",null,{"$f":"iCONDOMINI!C109","v":0},"D.04.99","D.05.99"]
[null,"da GESTIONI SPECIALI SEPARATE E FONDI","C.06",null,"v/s GESTIONI SPECIALI SEPARATE e FONDI","D.06"]
[null,{"$f":" IF(iDG!B87<>\"\",CONCATENATE(\"Da GESTIONE SPECIALE \",\"\"\"\", iDG!B87,\"\"\"\"),\"\")","v":"Da GESTIONE SPECIALE \"PROSPETTI\""},"C.06.01",null,{"$f":" IF(iDG!B87<>\"\",CONCATENATE(\"v/s GESTIONE SPECIALE \",\"\"\"\",iDG!B87,\"\"\"\"),\"\")","v":"v/s GESTIONE SPECIALE \"PROSPETTI\""},"D.06.01"]
[null,{"$f":" IF(iDG!B88<>\"\",CONCATENATE(\"Da GESTIONE SPECIALE \",\"\"\"\", iDG!B88,\"\"\"\"),\"\")","v":""},"C.06.02",null,{"$f":" IF(iDG!B88<>\"\",\"v/s \"  & iDG!B88,\"\")","v":""},"D.06.02"]
[null,{"$f":" IF(iDG!B89<>\"\",CONCATENATE(\"Da GESTIONE SPECIALE \",\"\"\"\", iDG!B89,\"\"\"\"),\"\")","v":""},"C.06.03",null,{"$f":" IF(iDG!B89<>\"\",\"v/s \"  & iDG!B89,\"\")","v":""},"D.06.03"]
[null,{"$f":" IF(iDG!B90<>\"\",CONCATENATE(\"Da GESTIONE SPECIALE \",\"\"\"\", iDG!B90,\"\"\"\"),\"\")","v":""},"C.06.04",null,{"$f":" IF(iDG!B90<>\"\",\"v/s \"  & iDG!B90,\"\")","v":""},"D.06.04"]
[null,{"$f":" IF(iDG!B91<>\"\",CONCATENATE(\"Da GESTIONE SPECIALE \",\"\"\"\", iDG!B91,\"\"\"\"),\"\")","v":""},"C.06.05",null,{"$f":" IF(iDG!B91<>\"\",\"v/s \"  & iDG!B91,\"\")","v":""},"D.06.05"]
[null,0,null,null,null,null,null,0]

{"sheet":"iPCF","index":9,"n_rows":15,"n_cols":4,"rows_kept":15,"cut":false,"hidden":true,"merged":[]}
[null,"Non avendo celle con sfondo bianco, il prospetto non può essere direttamante variato."]
[]
[]
[]
[null,{"$f":"iDG!B32","v":"Condominio Palazzo Duck"}]
[]
[]
[null,"PIANO GENERALE DEI CONTI"]
[null,"PIANO DEI CONTI FISCALI"]
[null,"TIPO DI OPERAZIONE CON RILEVANZA FISCALE","CODICE CONTO","Parametri variabili"]
[null,"Trattenuta della Ritenuta d'Acconto (R.A.) all'atto del pagamento del compenso al fornitore (codice F-nf), per il quale è prevista tale trattenuta sulla somma erogata a favore dell'ERARIO.\nIl documento contabile può essere sia fattura che ricevuta. ","H.Pww.nf","ww: percentuale R.A\nnf   : numero fornitore"]
[null,"Versamento all' Erario della Ritenuta d'Acconto (R.A.) ovvero dell'importo trattenuto a favore dell'ERARIO nel pagamento del fornitore (codice F-nf).","H.Rww.nf","ww: percentuale R.A\nnf   : numero fornitore"]
[]
[null,"Valori di nf    : da 01 a 20  [ il valore max di 20 è dovuto al numero massimo di fornitori soggetti a R.A. del foglio iTERZI ]"]
[null,"Valori di ww : 00 - 04 - 20 [valori da Legge dello Stato]"]

{"sheet":"iTERZI","index":10,"n_rows":84,"n_cols":12,"rows_kept":84,"cut":false,"hidden":true,"merged":[]}
[null,"È consentito variare i valori delle sole celle con sfondo bianco.",null,null,null,null,null,null,null,null,null,0]
[]
[]
[]
[null,{"$f":"iDG!B32","v":"Condominio Palazzo Duck"}]
[]
[null,"TERZI AL CONDOMINIO: PERSONE FISICHE E GIURIDICHE IN RAPPORTI ECONOMICI E/O FINANZIARI CON IL CONDOMINIO\n(sono esclusi i condomini)"]
[]
[null,"n.","Cognome/\nDitta","Nome/\nForma societaria","Codice Fiscale","Sesso","Data nascita","Comune di nascita","Prov. nascita","Domicilio fiscale","Codice"]
[null,"ESECUTORI DI LAVORI, DI PRESTAZIONI E DI SERVIZI\n(Soggetti privati ai quali devono essere attestate le somme loro erogate dal Condominio tramite Certificazione Unica)",null,null,null,null,null,null,null,null,"F"]
[null,1,"IL PAPERO ASCENSORI","srl","03766640794",null,null,null,null,"Via A. Pippo, 8 - 99999 PAPEROPOLI (TP)","F-01"]
[null,2,"CAVOLO CERTIFICAZIONI","SpA","01358590390",null,null,null,null,"Via Mdelle Rose, 33 - 99990 TOPOLINEA (TT)","F-02"]
[null,3,"Rokcerduck","srl","02258110390",null,null,null,null,"Via Dell'Oceano Pacifico, 16 - 99990 TOPOLINIA (TT)","F-03"]
[null,4,null,null,null,null,null,null,null,null,"F-04"]
[null,5,null,null,null,null,null,null,null,null,"F-05"]
[null,6,null,null,null,null,null,null,null,null,"F-06"]
[null,7,null,null,null,null,null,null,null,null,"F-07"]
[null,8,null,null,null,null,null,null,null,null,"F-08"]
[null,9,null,null,null,null,null,null,null,null,"F-09"]
[null,10,null,null,null,null,null,null,null,null,"F-10"]
[null,11,null,null,null,null,null,null,null,null,"F-11"]
[null,12,null,null,null,null,null,null,null,null,"F-12"]
[null,13,null,null,null,null,null,null,null,null,"F-13"]
[null,14,null,null,null,null,null,null,null,null,"F-14"]
[null,15,null,null,null,null,null,null,null,null,"F-15"]
[null,16,null,null,null,null,null,null,null,null,"F-16"]
[null,17,null,null,null,null,null,null,null,null,"F-17"]
[null,18,null,null,null,null,null,null,null,null,"F-18"]
[null,19,null,null,null,null,null,null,null,null,"F-19"]
[null,20,null,null,null,null,null,null,null,null,"F-20"]
[null," FORNITORI DI BENI, DI SERVIZI PUBBLICI ED UTENZE\n(Soggetti privati o pubblici ai quali non devono essere attestate le somme loro erogate dal Condominio tramite Certificazione Unica)",null,null,null,null,null,null,null,null,"C"]
[null,1,"PAPERO ENERGIA ","SpA",null,null,null,null,null,null,"C-01"]
[null,2,null,null,null,null,null,null,null,null,"C-02"]
[null,3,null,null,null,null,null,null,null,null,"C-03"]
[null,4,null,null,null,null,null,null,null,null,"C-04"]
[null,5,null,null,null,null,null,null,null,null,"C-05"]
[null,6,null,null,null,null,null,null,null,null,"C-06"]
[null,7,null,null,null,null,null,null,null,null,"C-07"]
[null,8,null,null,null,null,null,null,null,null,"C-08"]
[null,9,null,null,null,null,null,null,null,null,"C-09"]
[null,10,null,null,null,null,null,null,null,null,"C-10"]
[null,"CREDITORI PUBBLICI (per IMPOSTE E TASSE NON PAGATE)",null,null,null,null,null,null,null,null,"A"]
[null,1,"ERARIO",null,null,null,null,null,null,null,"A-01"]
[null,2,null,null,null,null,null,null,null,null,"A-02"]
[null,3,null,null,null,null,null,null,null,null,"A-03"]
[null,4,null,null,null,null,null,null,null,null,"A-04"]
[null,5,null,null,null,null,null,null,null,null,"A-05"]
[null,"CREDITORI PRIVATI",null,null,null,null,null,null,null,null,"Z"]
[null,1,"Amministratore (per anticipo di cassa)",null,null,null,null,null,null,null,"Z-01"]
[null,2,null,null,null,null,null,null,null,null,"Z-02"]
[null,3,null,null,null,null,null,null,null,null,"Z-03"]
[null,4,null,null,null,null,null,null,null,null,"Z-04"]
[null,5,null,null,null,null,null,null,null,null,"Z-05"]
[null,"CREDITORI DI GIRO (GESTIONI SPECIALI e FONDI dello stesso condominio)",null,null,null,null,null,null,null,null,"G"]
[null,1,{"$f":"IF(ISBLANK(iDG!B87),\"\",\"Fondo \" & iDG!B87)","v":"Fondo PROSPETTI"},null,null,null,null,null,null,null,"G-01"]
[null,2,{"$f":"IF(ISBLANK(iDG!B88),\"\",iDG!B88)","v":""},null,null,null,null,null,null,null,"G-02"]
[null,3,{"$f":"IF(ISBLANK(iDG!B89),\"\",iDG!B89)","v":""},null,null,null,null,null,null,null,"G-03"]
[null,4,{"$f":"IF(ISBLANK(iDG!B90),\"\",iDG!B90)","v":""},null,null,null,null,null,null,null,"G-04"]
[null,5,{"$f":"IF(ISBLANK(iDG!B91),\"\",iDG!B91)","v":""},null,null,null,null,null,null,null,"G-05"]
[null,"DEBITORI TERZI (per Somme condominiali depositate presso di loro)",null,null,null,null,null,null,null,null,"D"]
[null,1,"PAPERO ENERGIA ","SpA",null,null,null,null,null,null,"D-01"]
[null,2,null,null,null,null,null,null,null,null,"D-02"]
[null,3,null,null,null,null,null,null,null,null,"D-03"]
[null,4,null,null,null,null,null,null,null,null,"D-04"]
[null,5,null,null,null,null,null,null,null,null,"D-05"]
[null,"DEBITORI PRIVATI",null,null,null,null,null,null,null,null,"P"]
[null,1,null,null,null,null,null,null,null,null,"P-01"]
[null,2,null,null,null,null,null,null,null,null,"P-02"]
[null,3,null,null,null,null,null,null,null,null,"P-03"]
[null,4,null,null,null,null,null,null,null,null,"P-04"]
[null,5,null,null,null,null,null,null,null,null,"P-05"]
[null,"DEBITORI PUBBLICI (per IMPOSTE e TASSE versate in eccesso)",null,null,null,null,null,null,null,null,"E"]
[null,1,"ERARIO",null,null,null,null,null,null,null,"E-01"]
[null,2,null,null,null,null,null,null,null,null,"E-02"]
[null,3,null,null,null,null,null,null,null,null,"E-03"]
[null,4,null,null,null,null,null,null,null,null,"E-04"]
[null,5,null,null,null,null,null,null,null,null,"E-05"]
[null,"DEBITORI DI GIRO (GESTIONI SPECIALI e FONDI dello stesso condominio)",null,null,null,null,null,null,null,null,"S"]
[null,1,{"$f":"C55","v":"Fondo PROSPETTI"},null,null,null,null,null,null,null,"S-01"]
[null,2,{"$f":"C56","v":""},null,null,null,null,null,null,null,"S-02"]
[null,3,{"$f":"C57","v":""},null,null,null,null,null,null,null,"S-03"]
[null,4,{"$f":"C58","v":""},null,null,null,null,null,null,null,"S-04"]
[null,5,{"$f":"C59","v":""},null,null,null,null,null,null,null,"S-05"]
[null,null,null,null,null,null,null,null,null,null,null,0]

{"sheet":"iFONDI","index":11,"n_rows":43,"n_cols":10,"rows_kept":43,"cut":false,"hidden":true,"merged":[[10,1,10,4],[10,6,10,9]]}
[null,"È consentito variare i valori delle sole celle con sfondo bianco."]
[]
[]
[]
[null,{"$f":"iDG!B32","v":"Condominio Palazzo Duck"}]
[]
[]
[]
[null,"QUADRO RIASSUNTIVO DEGLI STATI PATRIMONIALI DELLE GESTIONI SPECIALE e/o FONDI"]
[null,{"$f":"\"ESERCIZIO \" & iDG!B97","v":"ESERCIZIO 2024"}]
[null,"ATTIVITÀ",null,null,null,null,"PASSIVITÀ"]
[null,"n°","CODICE FONDO","INIZIO\nESERCIZIO","IN CORSO\no FINE\nESERCIZIO",null,"n°","CODICE FONDO","INIZIO\nESERCIZIO","IN CORSO\no FINE\nESERCIZIO"]
[null,1,{"$f":"IF(iDG!B87<>\"\",iDG!B87,\"\")","v":"PROSPETTI"},{"$f":"SUM(D14:D18)","v":10607.849999999999},{"$f":"SUM(E14:E18)","v":1624.06},null,1,{"$f":"C13","v":"PROSPETTI"},{"$f":"SUM(I14:I18)","v":10607.85},{"$f":"SUM(J14:J18)","v":1624.06}]
[null,null,"DISPONIBILITÀ LIQUIDA IN CASSA"]
[null,null,"DISPONIBILITÀ LIQUIDA SUL CONTO CORRENTE",8890.7199999999993,null,null,null,"PASSIVITÀ SUL CONTO CORRENTE"]
[null,null,"CREDITI da CONDOMINI",1717.13,1624.06,null,null,"DEBITI v/s CONDOMINI",10607.85]
[null,null,"CREDITI da GESTIONE ORDINARIA",null,null,null,null,"DEBITI v/s GESTIONE ORDINARIA"]
[null,null,"CREDITI da TERZI",null,null,null,null,"DEBITI v/s TERZI",null,1624.06]
[null,2,{"$f":"IF(iDG!B88<>\"\",iDG!B88,\"\")","v":""},{"$f":"SUM(D20:D24)","v":0},{"$f":"SUM(E20:E24)","v":0},null,2,{"$f":"C19","v":""},{"$f":"SUM(I20:I24)","v":0},{"$f":"SUM(J20:J24)","v":0}]
[null,null,"DISPONIBILITÀ LIQUIDA IN CASSA"]
[null,null,"DISPONIBILITÀ LIQUIDA SUL CONTO CORRENTE",null,null,null,null,"PASSIVITÀ SUL CONTO CORRENTE"]
[null,null,"CREDITI da CONDOMINI",null,null,null,null,"DEBITI v/s CONDOMINI"]
[null,null,"CREDITI da GESTIONE ORDINARIA",null,null,null,null,"DEBITI v/s GESTIONE ORDINARIA"]
[null,null,"CREDITI da TERZI",null,null,null,null,"DEBITI v/s TERZI"]
[null,3,{"$f":"IF(iDG!B89<>\"\",iDG!B89,\"\")","v":""},{"$f":"SUM(D26:D30)","v":0},{"$f":"SUM(E26:E30)","v":0},null,3,{"$f":"C25","v":""},{"$f":"SUM(I26:I30)","v":0},{"$f":"SUM(J26:J30)","v":0}]
[null,null,"DISPONIBILITÀ LIQUIDA IN CASSA"]
[null,null,"DISPONIBILITÀ LIQUIDA SUL CONTO CORRENTE",null,null,null,null,"PASSIVITÀ SUL CONTO CORRENTE"]
[null,null,"CREDITI da CONDOMINI",null,null,null,null,"DEBITI v/s CONDOMINI"]
[null,null,"CREDITI da GESTIONE ORDINARIA",null,null,null,null,"DEBITI v/s GESTIONE ORDINARIA"]
[null,null,"CREDITI da TERZI",null,null,null,null,"DEBITI v/s TERZI"]
[null,4,{"$f":"IF(iDG!B90<>\"\",iDG!B90,\"\")","v":""},{"$f":"SUM(D32:D36)","v":0},{"$f":"SUM(E32:E36)","v":0},null,4,{"$f":"C31","v":""},{"$f":"SUM(I32:I36)","v":0},{"$f":"SUM(J32:J36)","v":0}]
[null,null,"DISPONIBILITÀ LIQUIDA IN CASSA"]
[null,null,"DISPONIBILITÀ LIQUIDA SUL CONTO CORRENTE",null,null,null,null,"PASSIVITÀ SUL CONTO CORRENTE"]
[null,null,"CREDITI da CONDOMINI",null,null,null,null,"DEBITI v/s CONDOMINI"]
[null,null,"CREDITI da GESTIONE ORDINARIA",null,null,null,null,"DEBITI v/s GESTIONE ORDINARIA"]
[null,null,"CREDITI da TERZI",null,null,null,null,"DEBITI v/s TERZI"]
[null,5,{"$f":"IF(iDG!B91<>\"\",iDG!B91,\"\")","v":""},{"$f":"SUM(D38:D42)","v":0},{"$f":"SUM(E38:E42)","v":0},null,5,{"$f":"C37","v":""},{"$f":"SUM(I38:I42)","v":0},{"$f":"SUM(J38:J42)","v":0}]
[null,null,"DISPONIBILITÀ LIQUIDA IN CASSA"]
[null,null,"DISPONIBILITÀ LIQUIDA SUL CONTO CORRENTE",null,null,null,null,"PASSIVITÀ SUL CONTO CORRENTE"]
[null,null,"CREDITI da CONDOMINI",null,null,null,null,"DEBITI v/s CONDOMINI"]
[null,null,"CREDITI da GESTIONE ORDINARIA",null,null,null,null,"DEBITI v/s GESTIONE ORDINARIA"]
[null,null,"CREDITI da TERZI",null,null,null,null,"DEBITI v/s TERZI"]
[null,"TOTALE ATTIVITÀ GESTIONI SPECIALI E FONDI",null,{"$f":"D13+D19+D25+D31+D37","v":10607.849999999999},{"$f":"E13+E19+E25+E31+E37","v":1624.06},null,"TOTALE PASSIVITÀ GESTIONI SPECIALI E FONDI",null,{"$f":"I13+I19+I25+I31+I37","v":10607.85},{"$f":"J13+J19+J25+J31+J37","v":1624.06}]

{"sheet":"iFondiCD","index":12,"n_rows":110,"n_cols":22,"rows_kept":110,"cut":false,"hidden":true,"merged":[[8,8,8,9],[3,1,3,21],[7,18,7,21],[8,18,8,19],[8,20,8,21],[8,1,9,1],[7,10,7,13],[8,10,8,11],[8,12,8,13],[7,14,7,17],[8,14,8,15],[8,16,8,17],[8,2,8,3],[8,4,8,5],[7,2,7,5],[7,6,7,9],[8,6,8,7]]}
[null,"È consentito variare i valori delle sole celle con sfondo bianco."]
[]
[]
[null,{"$f":"iDG!B32","v":"Condominio Palazzo Duck"}]
[null,"QUADRO RIASSUNTIVO DEGLI STATI PATRIMONIALI DELLE GESTIONI SPECIALE e/o FONDI"]
[null,{"$f":"\"ESERCIZIO \" & iDG!B97","v":"ESERCIZIO 2024"}]
[null,"PROSPETTO dei CREDITI e DEBITI DEI CONDOMINI"]
[null,"GESTIONE SPECIALE o FONDO",{"$f":"IF(iDG!B87<>\"\",iDG!B87,\"\")","v":"PROSPETTI"},null,null,null,{"$f":"IF(iDG!B88<>\"\",iDG!B88,\"\")","v":""},null,null,null,{"$f":"IF(iDG!B89<>\"\",iDG!B89,\"\")","v":""},null,null,null,{"$f":"IF(iDG!B90<>\"\",iDG!B90,\"\")","v":""},null,null,null,{"$f":"IF(iDG!B91<>\"\",iDG!B91,\"\")","v":""}]
[null,"CONDOMINO","INIZIO ESERCIZIO",null,"IN CORSO o FINE ESERCIZIO",null,"INIZIO ESERCIZIO",null,"IN CORSO o FINE ESERCIZIO",null,"INIZIO ESERCIZIO",null,"IN CORSO o FINE ESERCIZIO",null,"INIZIO ESERCIZIO",null,"IN CORSO o FINE ESERCIZIO",null,"INIZIO ESERCIZIO",null,"IN CORSO o FINE ESERCIZIO"]
[null,null,"CREDITI","DEBITI","CREDITI","DEBITI"]
[null,{"$f":"iCONDOMINI!C11","v":"Paperoga"},1086.98,null,1624.06]
[null,{"$f":"iCONDOMINI!C12","v":"Ciccio"},0,645.37]
[null,{"$f":"iCONDOMINI!C13","v":"Gastone"},630.15]
[null,{"$f":"iCONDOMINI!C14","v":"I tre nipotini"},null,3452.62]
[null,{"$f":"iCONDOMINI!C15","v":"Nonna Papera"},null,5961.44]
[null,{"$f":"iCONDOMINI!C16","v":"Fidanzati Paperino-Paperina"}]
[null,{"$f":"iCONDOMINI!C17","v":0}]
[null,{"$f":"iCONDOMINI!C18","v":0}]
[null,{"$f":"iCONDOMINI!C19","v":0}]
[null,{"$f":"iCONDOMINI!C20","v":0}]
[null,{"$f":"iCONDOMINI!C21","v":0}]
[null,{"$f":"iCONDOMINI!C22","v":0}]
[null,{"$f":"iCONDOMINI!C23","v":0}]
[null,{"$f":"iCONDOMINI!C24","v":0}]
[null,{"$f":"iCONDOMINI!C25","v":0}]
[null,{"$f":"iCONDOMINI!C26","v":0}]
[null,{"$f":"iCONDOMINI!C27","v":0}]
[null,{"$f":"iCONDOMINI!C28","v":0}]
[null,{"$f":"iCONDOMINI!C29","v":0}]
[null,{"$f":"iCONDOMINI!C30","v":0}]
[null,{"$f":"iCONDOMINI!C31","v":0}]
[null,{"$f":"iCONDOMINI!C32","v":0}]
[null,{"$f":"iCONDOMINI!C33","v":0}]
[null,{"$f":"iCONDOMINI!C34","v":0}]
[null,{"$f":"iCONDOMINI!C35","v":0}]
[null,{"$f":"iCONDOMINI!C36","v":0}]
[null,{"$f":"iCONDOMINI!C37","v":0}]
[null,{"$f":"iCONDOMINI!C38","v":0}]
[null,{"$f":"iCONDOMINI!C39","v":0}]
[null,{"$f":"iCONDOMINI!C40","v":0}]
[null,{"$f":"iCONDOMINI!C41","v":0}]
[null,{"$f":"iCONDOMINI!C42","v":0}]
[null,{"$f":"iCONDOMINI!C43","v":0}]
[null,{"$f":"iCONDOMINI!C44","v":0}]
[null,{"$f":"iCONDOMINI!C45","v":0}]
[null,{"$f":"iCONDOMINI!C46","v":0}]
[null,{"$f":"iCONDOMINI!C47","v":0}]
[null,{"$f":"iCONDOMINI!C48","v":0}]
[null,{"$f":"iCONDOMINI!C49","v":0}]
[null,{"$f":"iCONDOMINI!C50","v":0}]
[null,{"$f":"iCONDOMINI!C51","v":0}]
[null,{"$f":"iCONDOMINI!C52","v":0}]
[null,{"$f":"iCONDOMINI!C53","v":0}]
[null,{"$f":"iCONDOMINI!C54","v":0}]
[null,{"$f":"iCONDOMINI!C55","v":0}]
[null,{"$f":"iCONDOMINI!C56","v":0}]
[null,{"$f":"iCONDOMINI!C57","v":0},null,null,null,null,null,null,null,null,null,{"$f":"SUM(C57:K57)","v":0}]
[null,{"$f":"iCONDOMINI!C58","v":0},null,null,null,null,null,null,null,null,null,0]
[null,{"$f":"iCONDOMINI!C59","v":0},null,null,null,null,null,null,null,null,null,0]
[null,{"$f":"iCONDOMINI!C60","v":0},null,null,null,null,null,null,null,null,null,0]
[null,{"$f":"iCONDOMINI!C61","v":0},null,null,null,null,null,null,null,null,null,0]
[null,{"$f":"iCONDOMINI!C62","v":0},null,null,null,null,null,null,null,null,null,0]
[null,{"$f":"iCONDOMINI!C63","v":0},null,null,null,null,null,null,null,null,null,0]
[null,{"$f":"iCONDOMINI!C64","v":0},null,null,null,null,null,null,null,null,null,0]
[null,{"$f":"iCONDOMINI!C65","v":0},null,null,null,null,null,null,null,null,null,0]
[null,{"$f":"iCONDOMINI!C66","v":0},null,null,null,null,null,null,null,null,null,0]
[null,{"$f":"iCONDOMINI!C67","v":0},null,null,null,null,null,null,null,null,null,0]
[null,{"$f":"iCONDOMINI!C68","v":0},null,null,null,null,null,null,null,null,null,0]
[null,{"$f":"iCONDOMINI!C69","v":0},null,null,null,null,null,null,null,null,null,0]
[null,{"$f":"iCONDOMINI!C70","v":0},null,null,null,null,null,null,null,null,null,0]
[null,{"$f":"iCONDOMINI!C71","v":0},null,null,null,null,null,null,null,null,null,0]
[null,{"$f":"iCONDOMINI!C72","v":0},null,null,null,null,null,null,null,null,null,0]
[null,{"$f":"iCONDOMINI!C73","v":0},null,null,null,null,null,null,null,null,null,0]
[null,{"$f":"iCONDOMINI!C74","v":0},null,null,null,null,null,null,null,null,null,0]
[null,{"$f":"iCONDOMINI!C75","v":0},null,null,null,null,null,null,null,null,null,0]
[null,{"$f":"iCONDOMINI!C76","v":0},null,null,null,null,null,null,null,null,null,0]
[null,{"$f":"iCONDOMINI!C77","v":0},null,null,null,null,null,null,null,null,null,0]
[null,{"$f":"iCONDOMINI!C78","v":0},null,null,null,null,null,null,null,null,null,0]
[null,{"$f":"iCONDOMINI!C79","v":0},null,null,null,null,null,null,null,null,null,0]
[null,{"$f":"iCONDOMINI!C80","v":0},null,null,null,null,null,null,null,null,null,0]
[null,{"$f":"iCONDOMINI!C81","v":0},null,null,null,null,null,null,null,null,null,0]
[null,{"$f":"iCONDOMINI!C82","v":0},null,null,null,null,null,null,null,null,null,0]
[null,{"$f":"iCONDOMINI!C83","v":0},null,null,null,null,null,null,null,null,null,0]
[null,{"$f":"iCONDOMINI!C84","v":0},null,null,null,null,null,null,null,null,null,0]
[null,{"$f":"iCONDOMINI!C85","v":0},null,null,null,null,null,null,null,null,null,0]
[null,{"$f":"iCONDOMINI!C86","v":0},null,null,null,null,null,null,null,null,null,0]
[null,{"$f":"iCONDOMINI!C87","v":0},null,null,null,null,null,null,null,null,null,0]
[null,{"$f":"iCONDOMINI!C88","v":0},null,null,null,null,null,null,null,null,null,0]
[null,{"$f":"iCONDOMINI!C89","v":0},null,null,null,null,null,null,null,null,null,0]
[null,{"$f":"iCONDOMINI!C90","v":0},null,null,null,null,null,null,null,null,null,0]
[null,{"$f":"iCONDOMINI!C91","v":0},null,null,null,null,null,null,null,null,null,0]
[null,{"$f":"iCONDOMINI!C92","v":0},null,null,null,null,null,null,null,null,null,0]
[null,{"$f":"iCONDOMINI!C93","v":0},null,null,null,null,null,null,null,null,null,0]
[null,{"$f":"iCONDOMINI!C94","v":0},null,null,null,null,null,null,null,null,null,0]
[null,{"$f":"iCONDOMINI!C95","v":0},null,null,null,null,null,null,null,null,null,0]
[null,{"$f":"iCONDOMINI!C96","v":0},null,null,null,null,null,null,null,null,null,0]
[null,{"$f":"iCONDOMINI!C97","v":0},null,null,null,null,null,null,null,null,null,0]
[null,{"$f":"iCONDOMINI!C98","v":0},null,null,null,null,null,null,null,null,null,0]
[null,{"$f":"iCONDOMINI!C99","v":0},null,null,null,null,null,null,null,null,null,0]
[null,{"$f":"iCONDOMINI!C100","v":0},null,null,null,null,null,null,null,null,null,0]
[null,{"$f":"iCONDOMINI!C101","v":0},null,null,null,null,null,null,null,null,null,0]
[null,{"$f":"iCONDOMINI!C102","v":0},null,null,null,null,null,null,null,null,null,0]
[null,{"$f":"iCONDOMINI!C103","v":0},null,null,null,null,null,null,null,null,null,0]
[null,{"$f":"iCONDOMINI!C104","v":0},null,null,null,null,null,null,null,null,null,0]
[null,{"$f":"iCONDOMINI!C105","v":0},null,null,null,null,null,null,null,null,null,0]
[null,{"$f":"iCONDOMINI!C106","v":0},null,null,null,null,null,null,null,null,null,0]
[null,{"$f":"iCONDOMINI!C107","v":0},null,null,null,null,null,null,null,null,null,0]
[null,{"$f":"iCONDOMINI!C108","v":0},null,null,null,null,null,null,null,null,null,0]
[null,{"$f":"iCONDOMINI!C109","v":0},null,null,null,null,null,null,null,null,null,{"$f":"SUM(C109:K109)","v":0}]
[null,"TOTALI",{"$f":"SUM(C11:C109)","v":1717.13},{"$f":"SUM(D11:D109)","v":10059.43},1624.06,0,0,0,0,0,0,0,0,0,0,0,0,0,0,0,0,0]

{"sheet":"iUSCITE_P","index":13,"n_rows":197,"n_cols":8,"rows_kept":197,"cut":false,"hidden":true,"merged":[[196,1,196,3],[8,3,9,3],[8,1,9,1],[8,2,9,2],[194,1,194,3],[195,1,195,3]]}
[null,"È consentito variare i valori delle sole celle con sfondo bianco o con nessun riempimento.",null,null,null,null,{"$f":"SUMIFS(G12:G88,iPCU!F12:F88,\">0\")","v":2795},0]
[null,""]
[null,""]
[null,""]
[null,{"$f":"iDG!B32","v":"Condominio Palazzo Duck"}]
[null,""]
[null,""]
[null,{"$f":"\"PREVENTIVO DELLE SPESE PER L'ESERCIZIO \" & iDG!B97","v":"PREVENTIVO DELLE SPESE PER L'ESERCIZIO 2024"}]
[null,"CAPITOLI e VOCI DI SPESA","CODICE\nCONTO","TABELLA\nRIPARTO","IMPORTI","SUDDIVISIONE"]
[null,null,null,null,"PREVENTIV.","PROPRIETARIO","INQUILINO"]
[null,{"$f":"iPCU!B11","v":"SPESE GENERALI"},null,{"$f":"iPCU!D11","v":0},{"$f":"SUMIFS(E12:E26,D12:D26,\"=?\")","v":1450}]
[null,{"$f":"iPCU!B12","v":"COMPETENZE BANCARIE (Oneri,Commissioni, interessi, ecc)"},{"$f":"iPCU!C12","v":"S.01.01"},{"$f":"iPCU!D12","v":"A"},250,{"$f":"E12*iPCU!E12","v":250},{"$f":"E12*iPCU!F12","v":0}]
[null,{"$f":"iPCU!B13","v":"CANCELLERIA"},{"$f":"iPCU!C13","v":"S.01.02"},{"$f":"iPCU!D13","v":"A"},10,{"$f":"E13*iPCU!E13","v":10},{"$f":"E13*iPCU!F13","v":0}]
[null,{"$f":"iPCU!B14","v":"POSTALI, TELEGRAFICHE, TELEFONICHE E WEB "},{"$f":"iPCU!C14","v":"S.01.03"},{"$f":"iPCU!D14","v":"A"},20,{"$f":"E14*iPCU!E14","v":20},{"$f":"E14*iPCU!F14","v":0}]
[null,{"$f":"iPCU!B15","v":"DIRITTI BOLLI TASSE"},{"$f":"iPCU!C15","v":"S.01.04"},{"$f":"iPCU!D15","v":"A"},20,{"$f":"E15*iPCU!E15","v":20},{"$f":"E15*iPCU!F15","v":0}]
[null,{"$f":"iPCU!B16","v":"SPESE PER ADEMPIMENTI FISCALI"},{"$f":"iPCU!C16","v":"S.01.05"},{"$f":"iPCU!D16","v":"A"},120,{"$f":"E16*iPCU!E16","v":120},{"$f":"E16*iPCU!F16","v":0}]
[null,{"$f":"iPCU!B17","v":"COMPENSI AMMINISTRATORE"},{"$f":"iPCU!C17","v":"S.01.06"},{"$f":"iPCU!D17","v":"A"},500,{"$f":"E17*iPCU!E17","v":500},{"$f":"E17*iPCU!F17","v":0}]
[null,{"$f":"iPCU!B18","v":"COMPENSI A TERZI (consulenti, ...)"},{"$f":"iPCU!C18","v":"S.01.07"},{"$f":"iPCU!D18","v":"A"},5,{"$f":"E18*iPCU!E18","v":5},{"$f":"E18*iPCU!F18","v":0}]
[null,{"$f":"iPCU!B19","v":"SPESE LEGALI, CONTRATTUALI e RECUPERO CREDITI"},{"$f":"iPCU!C19","v":"S.01.08"},{"$f":"iPCU!D19","v":"A"},500,{"$f":"E19*iPCU!E19","v":500},{"$f":"E19*iPCU!F19","v":0}]
[null,{"$f":"iPCU!B20","v":"ASSICURAZIONE FABBRICATO"},{"$f":"iPCU!C20","v":"S.01.09"},{"$f":"iPCU!D20","v":"A"},5,{"$f":"E20*iPCU!E20","v":5},{"$f":"E20*iPCU!F20","v":0}]
[null,{"$f":"iPCU!B21","v":"ALTRE SPESE GENERALI"},{"$f":"iPCU!C21","v":"S.01.10"},{"$f":"iPCU!D21","v":"A"},20,{"$f":"E21*iPCU!E21","v":20},{"$f":"E21*iPCU!F21","v":0}]
[null,{"$f":"iPCU!B22","v":0},{"$f":"iPCU!C22","v":"S.01.11"},{"$f":"iPCU!D22","v":0},0,{"$f":"E22*iPCU!E22","v":0},{"$f":"E22*iPCU!F22","v":0}]
[null,{"$f":"iPCU!B23","v":0},{"$f":"iPCU!C23","v":"S.01.12"},{"$f":"iPCU!D23","v":0},0,{"$f":"E23*iPCU!E23","v":0},{"$f":"E23*iPCU!F23","v":0}]
[null,{"$f":"iPCU!B24","v":0},{"$f":"iPCU!C24","v":"S.01.13"},{"$f":"iPCU!D24","v":0},0,{"$f":"E24*iPCU!E24","v":0},{"$f":"E24*iPCU!F24","v":0}]
[null,{"$f":"iPCU!B25","v":0},{"$f":"iPCU!C25","v":"S.01.14"},{"$f":"iPCU!D25","v":0},0,{"$f":"E25*iPCU!E25","v":0},{"$f":"E25*iPCU!F25","v":0}]
[null,{"$f":"iPCU!B26","v":0},{"$f":"iPCU!C26","v":"S.01.15"},{"$f":"iPCU!D26","v":0},0,{"$f":"E26*iPCU!E26","v":0},{"$f":"E26*iPCU!F26","v":0}]
[null,{"$f":"iPCU!B27","v":"PULIZIE"},null,{"$f":"iPCU!D27","v":0},{"$f":"SUMIFS(E28:E37,D28:D37,\"=?\")","v":75},0,0]
[null,{"$f":"iPCU!B28","v":"PULIZIE SCALE: PERSONALE"},{"$f":"iPCU!C28","v":"S.02.01"},{"$f":"iPCU!D28","v":"B"},5,{"$f":"E28*iPCU!E28","v":0},{"$f":"E28*iPCU!F28","v":5}]
[null,{"$f":"iPCU!B29","v":"PULIZIE SCALE: ATTREZZI E PRODOTTI"},{"$f":"iPCU!C29","v":"S.02.02"},{"$f":"iPCU!D29","v":"B"},10,{"$f":"E29*iPCU!E29","v":0},{"$f":"E29*iPCU!F29","v":10}]
[null,{"$f":"iPCU!B30","v":"MANUTENZIONE ORDINARIA SCALE"},{"$f":"iPCU!C30","v":"S.02.03"},{"$f":"iPCU!D30","v":"B"},50,{"$f":"E30*iPCU!E30","v":0},{"$f":"E30*iPCU!F30","v":50}]
[null,{"$f":"iPCU!B31","v":"ALTRE SPESE DOCUMENTATE"},{"$f":"iPCU!C31","v":"S.02.04"},{"$f":"iPCU!D31","v":"B"},10,{"$f":"E31*iPCU!E31","v":0},{"$f":"E31*iPCU!F31","v":10}]
[null,{"$f":"iPCU!B32","v":0},{"$f":"iPCU!C32","v":"S.02.05"},{"$f":"iPCU!D32","v":""},0,{"$f":"E32*iPCU!E32","v":0},{"$f":"E32*iPCU!F32","v":0}]
[null,{"$f":"iPCU!B33","v":0},{"$f":"iPCU!C33","v":"S.02.06"},{"$f":"iPCU!D33","v":""},0,{"$f":"E33*iPCU!E33","v":0},{"$f":"E33*iPCU!F33","v":0}]
[null,{"$f":"iPCU!B34","v":0},{"$f":"iPCU!C34","v":"S.02.07"},{"$f":"iPCU!D34","v":""},0,{"$f":"E34*iPCU!E34","v":0},{"$f":"E34*iPCU!F34","v":0}]
[null,{"$f":"iPCU!B35","v":0},{"$f":"iPCU!C35","v":"S.02.08"},{"$f":"iPCU!D35","v":""},0,{"$f":"E35*iPCU!E35","v":0},{"$f":"E35*iPCU!F35","v":0}]
[null,{"$f":"iPCU!B36","v":0},{"$f":"iPCU!C36","v":"S.02.09"},{"$f":"iPCU!D36","v":""},0,{"$f":"E36*iPCU!E36","v":0},{"$f":"E36*iPCU!F36","v":0}]
[null,{"$f":"iPCU!B37","v":0},{"$f":"iPCU!C37","v":"S.02.10"},{"$f":"iPCU!D37","v":""},0,{"$f":"E37*iPCU!E37","v":0},{"$f":"E37*iPCU!F37","v":0}]
[null,{"$f":"iPCU!B38","v":"ASCENSORE"},null,{"$f":"iPCU!D38","v":0},{"$f":"SUMIFS(E39:E48,D39:D48,\"=?\")","v":1020}]
[null,{"$f":"iPCU!B39","v":"CONTRATTO MANUTENZIONE ASCENSORE"},{"$f":"iPCU!C39","v":"S.03.01"},{"$f":"iPCU!D39","v":"C"},700,{"$f":"E39*iPCU!E39","v":0},{"$f":"E39*iPCU!F39","v":700}]
[null,{"$f":"iPCU!B40","v":"VERIFICA PERIODICA ASCENSORE"},{"$f":"iPCU!C40","v":"S.03.02"},{"$f":"iPCU!D40","v":"C"},200,{"$f":"E40*iPCU!E40","v":0},{"$f":"E40*iPCU!F40","v":200}]
[null,{"$f":"iPCU!B41","v":"RIPARAZIONI  ASCENSORE"},{"$f":"iPCU!C41","v":"S.03.03"},{"$f":"iPCU!D41","v":"C"},100,{"$f":"E41*iPCU!E41","v":0},{"$f":"E41*iPCU!F41","v":100}]
[null,{"$f":"iPCU!B42","v":"ADEGUAMENTO ASCENSORE"},{"$f":"iPCU!C42","v":"S.03.04"},{"$f":"iPCU!D42","v":"C"},10,{"$f":"E42*iPCU!E42","v":0},{"$f":"E42*iPCU!F42","v":10}]
[null,{"$f":"iPCU!B43","v":"ALTRE SPESE DOCUMENTATE"},{"$f":"iPCU!C43","v":"S.03.05"},{"$f":"iPCU!D43","v":"C"},10,{"$f":"E43*iPCU!E43","v":0},{"$f":"E43*iPCU!F43","v":10}]
[null,{"$f":"iPCU!B44","v":0},{"$f":"iPCU!C44","v":"S.03.06"},{"$f":"iPCU!D44","v":0},0,{"$f":"E44*iPCU!E44","v":0},{"$f":"E44*iPCU!F44","v":0}]
[null,{"$f":"iPCU!B45","v":0},{"$f":"iPCU!C45","v":"S.03.07"},{"$f":"iPCU!D45","v":0},0,{"$f":"E45*iPCU!E45","v":0},{"$f":"E45*iPCU!F45","v":0}]
[null,{"$f":"iPCU!B46","v":0},{"$f":"iPCU!C46","v":"S.03.08"},{"$f":"iPCU!D46","v":0},0,{"$f":"E46*iPCU!E46","v":0},{"$f":"E46*iPCU!F46","v":0}]
[null,{"$f":"iPCU!B47","v":0},{"$f":"iPCU!C47","v":"S.03.09"},{"$f":"iPCU!D47","v":0},0,{"$f":"E47*iPCU!E47","v":0},{"$f":"E47*iPCU!F47","v":0}]
[null,{"$f":"iPCU!B48","v":0},{"$f":"iPCU!C48","v":"S.03.10"},{"$f":"iPCU!D48","v":0},0,{"$f":"E48*iPCU!E48","v":0},{"$f":"E48*iPCU!F48","v":0}]
[null,{"$f":"iPCU!B49","v":"CONSUMI DI ENERGIA E ACQUA"},null,{"$f":"iPCU!D49","v":0},{"$f":"SUMIFS(E50:E59,D50:D59,\"=?\")","v":1530}]
[null,{"$f":"iPCU!B50","v":"ENERGIA ILLUMINAZIONE"},{"$f":"iPCU!C50","v":"S.04.01"},{"$f":"iPCU!D50","v":"B"},320,{"$f":"E50*iPCU!E50","v":0},{"$f":"E50*iPCU!F50","v":320}]
[null,{"$f":"iPCU!B51","v":"ENERGIA ALIMENTAZIONE ASCENSORE"},{"$f":"iPCU!C51","v":"S.04.02"},{"$f":"iPCU!D51","v":"C"},1200,{"$f":"E51*iPCU!E51","v":0},{"$f":"E51*iPCU!F51","v":1200}]
[null,{"$f":"iPCU!B52","v":"ENERGIA ALIMENTAZIONE IMPIANTO TV"},{"$f":"iPCU!C52","v":"S.04.03"},{"$f":"iPCU!D52","v":"F"},10,{"$f":"E52*iPCU!E52","v":0},{"$f":"E52*iPCU!F52","v":10}]
[null,{"$f":"iPCU!B53","v":0},{"$f":"iPCU!C53","v":"S.04.04"},{"$f":"iPCU!D53","v":0},0,{"$f":"E53*iPCU!E53","v":0},{"$f":"E53*iPCU!F53","v":0}]
[null,{"$f":"iPCU!B54","v":0},{"$f":"iPCU!C54","v":"S.04.05"},{"$f":"iPCU!D54","v":0},0,{"$f":"E54*iPCU!E54","v":0},{"$f":"E54*iPCU!F54","v":0}]
[null,{"$f":"iPCU!B55","v":0},{"$f":"iPCU!C55","v":"S.04.06"},{"$f":"iPCU!D55","v":0},0,{"$f":"E55*iPCU!E55","v":0},{"$f":"E55*iPCU!F55","v":0}]
[null,{"$f":"iPCU!B56","v":0},{"$f":"iPCU!C56","v":"S.04.07"},{"$f":"iPCU!D56","v":0},0,{"$f":"E56*iPCU!E56","v":0},{"$f":"E56*iPCU!F56","v":0}]
[null,{"$f":"iPCU!B57","v":0},{"$f":"iPCU!C57","v":"S.04.08"},{"$f":"iPCU!D57","v":0},0,{"$f":"E57*iPCU!E57","v":0},{"$f":"E57*iPCU!F57","v":0}]
[null,{"$f":"iPCU!B58","v":0},{"$f":"iPCU!C58","v":"S.04.09"},{"$f":"iPCU!D58","v":0},0,{"$f":"E58*iPCU!E58","v":0},{"$f":"E58*iPCU!F58","v":0}]
[null,{"$f":"iPCU!B59","v":0},{"$f":"iPCU!C59","v":"S.04.10"},{"$f":"iPCU!D59","v":0},0,{"$f":"E59*iPCU!E59","v":0},{"$f":"E59*iPCU!F59","v":0}]
[null,{"$f":"iPCU!B60","v":"IMPIANTI TV e CITOFONICO"},null,{"$f":"iPCU!D60","v":0},{"$f":"SUMIFS(E61:E70,D61:D70,\"=?\")","v":80}]
[null,{"$f":"iPCU!B61","v":"MANUTENZIONE E RIPARAZIONE CITOFONO"},{"$f":"iPCU!C61","v":"S.05.01"},{"$f":"iPCU!D61","v":"G"},10,{"$f":"E61*iPCU!E61","v":0},{"$f":"E61*iPCU!F61","v":10}]
[null,{"$f":"iPCU!B62","v":"ALTRE SPESE DOCUMENTATE SU CITOFONO"},{"$f":"iPCU!C62","v":"S.05.02"},{"$f":"iPCU!D62","v":"G"},10,{"$f":"E62*iPCU!E62","v":10},{"$f":"E62*iPCU!F62","v":0}]
[null,{"$f":"iPCU!B63","v":"MANUTENZIONE E RIPARAZIONE IMPIANTO TV"},{"$f":"iPCU!C63","v":"S.05.03"},{"$f":"iPCU!D63","v":"F"},30,{"$f":"E63*iPCU!E63","v":0},{"$f":"E63*iPCU!F63","v":30}]
[null,{"$f":"iPCU!B64","v":"ALTRE SPESE DOCUMENTATE SU IMPIANTO TV"},{"$f":"iPCU!C64","v":"S.05.04"},{"$f":"iPCU!D64","v":"F"},30,{"$f":"E64*iPCU!E64","v":30},{"$f":"E64*iPCU!F64","v":0}]
[null,{"$f":"iPCU!B65","v":0},{"$f":"iPCU!C65","v":"S.05.05"},{"$f":"iPCU!D65","v":0},0,{"$f":"E65*iPCU!E65","v":0},{"$f":"E65*iPCU!F65","v":0}]
[null,{"$f":"iPCU!B66","v":0},{"$f":"iPCU!C66","v":"S.05.06"},{"$f":"iPCU!D66","v":0},0,{"$f":"E66*iPCU!E66","v":0},{"$f":"E66*iPCU!F66","v":0}]
[null,{"$f":"iPCU!B67","v":0},{"$f":"iPCU!C67","v":"S.05.07"},{"$f":"iPCU!D67","v":0},0,{"$f":"E67*iPCU!E67","v":0},{"$f":"E67*iPCU!F67","v":0}]
[null,{"$f":"iPCU!B68","v":0},{"$f":"iPCU!C68","v":"S.05.08"},{"$f":"iPCU!D68","v":0},0,{"$f":"E68*iPCU!E68","v":0},{"$f":"E68*iPCU!F68","v":0}]
[null,{"$f":"iPCU!B69","v":0},{"$f":"iPCU!C69","v":"S.05.09"},{"$f":"iPCU!D69","v":0},0,{"$f":"E69*iPCU!E69","v":0},{"$f":"E69*iPCU!F69","v":0}]
[null,{"$f":"iPCU!B70","v":0},{"$f":"iPCU!C70","v":"S.05.10"},{"$f":"iPCU!D70","v":0},0,{"$f":"E70*iPCU!E70","v":0},{"$f":"E70*iPCU!F70","v":0}]
[null,{"$f":"iPCU!B71","v":"MANUTENZIONI ORDINARIE EDILI"},null,{"$f":"iPCU!D71","v":0},{"$f":"SUMIFS(E72:E76,D72:D76,\"=?\")","v":130}]
[null,{"$f":"iPCU!B72","v":"MANUTENZIONI ORDINARIE PARTI COMUNI INTERO EDIFICIO"},{"$f":"iPCU!C72","v":"S.06.01"},{"$f":"iPCU!D72","v":"A"},100,{"$f":"E72*iPCU!E72","v":0},{"$f":"E72*iPCU!F72","v":100}]
[null,{"$f":"iPCU!B73","v":"MANUTENZIONI ORDINARIE PARTI COMUNI ABITAZIONI"},{"$f":"iPCU!C73","v":"S.06.02"},{"$f":"iPCU!D73","v":"D"},15,{"$f":"E73*iPCU!E73","v":0},{"$f":"E73*iPCU!F73","v":15}]
[null,{"$f":"iPCU!B74","v":"MANUTENZIONI ORDINARIE PARTI COMUNI NEGOZI"},{"$f":"iPCU!C74","v":"S.06.03"},{"$f":"iPCU!D74","v":"E"},15,{"$f":"E74*iPCU!E74","v":0},{"$f":"E74*iPCU!F74","v":15}]
[null,{"$f":"iPCU!B75","v":0},{"$f":"iPCU!C75","v":"S.06.04"},{"$f":"iPCU!D75","v":0},0,{"$f":"E75*iPCU!E75","v":0},{"$f":"E75*iPCU!F75","v":0}]
[null,{"$f":"iPCU!B76","v":0},{"$f":"iPCU!C76","v":"S.06.05"},{"$f":"iPCU!D76","v":0},0,{"$f":"E76*iPCU!E76","v":0},{"$f":"E76*iPCU!F76","v":0}]
[null,{"$f":"iPCU!B77","v":"MANUTENZIONI STRAORDINARIE EDILI"},null,{"$f":"iPCU!D77","v":0},{"$f":"SUMIFS(E78:E82,D78:D82,\"=?\")","v":35}]
[null,{"$f":"iPCU!B78","v":"MANUTENZIONI STRAORDINARIE PARTI COMUNI INTERO EDIFICIO"},{"$f":"iPCU!C78","v":"S.07.01"},{"$f":"iPCU!D78","v":"A"},15,{"$f":"E78*iPCU!E78","v":15},{"$f":"E78*iPCU!F78","v":0}]
[null,{"$f":"iPCU!B79","v":"MANUTENZIONI STRAORDINARIE PARTI COMUNI ABITAZIONI"},{"$f":"iPCU!C79","v":"S.07.02"},{"$f":"iPCU!D79","v":"D"},10,{"$f":"E79*iPCU!E79","v":10},{"$f":"E79*iPCU!F79","v":0}]
[null,{"$f":"iPCU!B80","v":"MANUTENZIONI STRAORDINARIE PARTI COMUNI NEGOZI"},{"$f":"iPCU!C80","v":"S.07.03"},{"$f":"iPCU!D80","v":"E"},10,{"$f":"E80*iPCU!E80","v":10},{"$f":"E80*iPCU!F80","v":0}]
[null,{"$f":"iPCU!B81","v":0},{"$f":"iPCU!C81","v":"S.07.04"},{"$f":"iPCU!D81","v":0},0,{"$f":"E81*iPCU!E81","v":0},{"$f":"E81*iPCU!F81","v":0}]
[null,{"$f":"iPCU!B82","v":0},{"$f":"iPCU!C82","v":"S.07.05"},{"$f":"iPCU!D82","v":0},0,{"$f":"E82*iPCU!E82","v":0},{"$f":"E82*iPCU!F82","v":0}]
[null,{"$f":"iPCU!B83","v":"USCITE PER COSTITUZIONE DEPOSITI PRESSO TERZI e PRESTITI A TERZI"},{"$f":"iPCU!C83","v":"L"},null,{"$f":"SUMIFS(E84:E88,D84:D88,\"=?\")","v":0}]
[null,{"$f":"iPCU!B84","v":"DEPOSITI CAUZIONALI"},{"$f":"iPCU!C84","v":"L.01.01"},{"$f":"iPCU!D84","v":"A"},null,{"$f":"E84*iPCU!E84","v":0},{"$f":"E84*iPCU!F84","v":0}]
[null,{"$f":"iPCU!B85","v":"ACQUISTO VOUCHER LAVORI"},{"$f":"iPCU!C85","v":"L.01.02"},{"$f":"iPCU!D85","v":"A"},null,{"$f":"E85*iPCU!E85","v":0},{"$f":"E85*iPCU!F85","v":0}]
[null,{"$f":"iPCU!B86","v":"PRESTITI A TERZI"},{"$f":"iPCU!C86","v":"L.01.03"},{"$f":"iPCU!D86","v":"A"},null,{"$f":"E86*iPCU!E86","v":0},{"$f":"E86*iPCU!F86","v":0}]
[null,{"$f":"iPCU!B87","v":0},{"$f":"iPCU!C87","v":"L.01.04"},{"$f":"iPCU!D87","v":0},0,{"$f":"E87*iPCU!E87","v":0},{"$f":"E87*iPCU!F87","v":0}]
[null,{"$f":"iPCU!B88","v":0},{"$f":"iPCU!C88","v":"L.01.05"},{"$f":"iPCU!D88","v":0},0,{"$f":"E88*iPCU!E88","v":0},{"$f":"E88*iPCU!F88","v":0}]
[null,{"$f":"iPCU!B201","v":"USCITE PER CONTO DI GESTIONI SPECIALI SEPARATI e FONDI "},{"$f":"iPCU!C201","v":"G"},null,null,{"$f":"E89*iPCU!E201","v":0},{"$f":"E89*iPCU!F201","v":0}]
[null,{"$f":"iPCU!B202","v":"Uscite per conto di GESTIONE SPECIALE \"PROSPETTI\""},{"$f":"iPCU!C202","v":"G.01.01"},null,0,{"$f":"E90*iPCU!E202","v":0},{"$f":"E90*iPCU!F202","v":0}]
[null,{"$f":"iPCU!B203","v":""},{"$f":"iPCU!C203","v":"G.01.02"},null,0,{"$f":"E91*iPCU!E203","v":0},{"$f":"E91*iPCU!F203","v":0}]
[null,{"$f":"iPCU!B204","v":""},{"$f":"iPCU!C204","v":"G.01.03"},null,0,{"$f":"E92*iPCU!E204","v":0},{"$f":"E92*iPCU!F204","v":0}]
[null,{"$f":"iPCU!B205","v":""},{"$f":"iPCU!C205","v":"G.01.04"},null,0,{"$f":"E93*iPCU!E205","v":0},{"$f":"E93*iPCU!F205","v":0}]
[null,{"$f":"iPCU!B206","v":""},{"$f":"iPCU!C206","v":"G.01.05"},null,0,{"$f":"E94*iPCU!E206","v":0},{"$f":"E94*iPCU!F206","v":0}]
[null,{"$f":"iPCU!B89","v":"SPESE PERSONALI CONDOMINI o ASSEGNATE DIRETTAMENTE AI CONDOMINI"},{"$f":"iPCU!C89","v":"P"},null,{"$f":"SUM(E96:E194)","v":0},{"$f":"SUM(F96:F194)","v":0},{"$f":"SUM(G96:G194)","v":0}]
[null,{"$f":"iPCU!B90","v":"Paperoga"},{"$f":"iPCU!C90","v":"P.01.01"},null,null,{"$f":"E96*iPCU!E90","v":0},{"$f":"E96*iPCU!F90","v":0}]
[null,{"$f":"iPCU!B91","v":"Ciccio"},{"$f":"iPCU!C91","v":"P.01.02"},null,null,{"$f":"E97*iPCU!E91","v":0},{"$f":"E97*iPCU!F91","v":0}]
[null,{"$f":"iPCU!B92","v":"Gastone"},{"$f":"iPCU!C92","v":"P.01.03"},null,null,{"$f":"E98*iPCU!E92","v":0},{"$f":"E98*iPCU!F92","v":0}]
[null,{"$f":"iPCU!B93","v":"I tre nipotini"},{"$f":"iPCU!C93","v":"P.01.04"},null,null,{"$f":"E99*iPCU!E93","v":0},{"$f":"E99*iPCU!F93","v":0}]
[null,{"$f":"iPCU!B94","v":"Nonna Papera"},{"$f":"iPCU!C94","v":"P.01.05"},null,null,{"$f":"E100*iPCU!E94","v":0},{"$f":"E100*iPCU!F94","v":0}]
[null,{"$f":"iPCU!B95","v":"Fidanzati Paperino-Paperina"},{"$f":"iPCU!C95","v":"P.01.06"},null,null,{"$f":"E101*iPCU!E95","v":0},{"$f":"E101*iPCU!F95","v":0}]
[null,{"$f":"iPCU!B96","v":""},{"$f":"iPCU!C96","v":"P.01.07"},null,0,{"$f":"E102*iPCU!E96","v":0},{"$f":"E102*iPCU!F96","v":0}]
[null,{"$f":"iPCU!B97","v":""},{"$f":"iPCU!C97","v":"P.01.08"},null,0,{"$f":"E103*iPCU!E97","v":0},{"$f":"E103*iPCU!F97","v":0}]
[null,{"$f":"iPCU!B98","v":""},{"$f":"iPCU!C98","v":"P.01.09"},null,0,{"$f":"E104*iPCU!E98","v":0},{"$f":"E104*iPCU!F98","v":0}]
[null,{"$f":"iPCU!B99","v":""},{"$f":"iPCU!C99","v":"P.01.10"},null,0,{"$f":"E105*iPCU!E99","v":0},{"$f":"E105*iPCU!F99","v":0}]
[null,{"$f":"iPCU!B100","v":""},{"$f":"iPCU!C100","v":"P.01.11"},null,0,{"$f":"E106*iPCU!E100","v":0},{"$f":"E106*iPCU!F100","v":0}]
[null,{"$f":"iPCU!B101","v":""},{"$f":"iPCU!C101","v":"P.01.12"},null,0,{"$f":"E107*iPCU!E101","v":0},{"$f":"E107*iPCU!F101","v":0}]
[null,{"$f":"iPCU!B102","v":""},{"$f":"iPCU!C102","v":"P.01.13"},null,0,{"$f":"E108*iPCU!E102","v":0},{"$f":"E108*iPCU!F102","v":0}]
[null,{"$f":"iPCU!B103","v":""},{"$f":"iPCU!C103","v":"P.01.14"},null,0,{"$f":"E109*iPCU!E103","v":0},{"$f":"E109*iPCU!F103","v":0}]
[null,{"$f":"iPCU!B104","v":""},{"$f":"iPCU!C104","v":"P.01.15"},null,0,{"$f":"E110*iPCU!E104","v":0},{"$f":"E110*iPCU!F104","v":0}]
[null,{"$f":"iPCU!B105","v":""},{"$f":"iPCU!C105","v":"P.01.16"},null,0,{"$f":"E111*iPCU!E105","v":0},{"$f":"E111*iPCU!F105","v":0}]
[null,{"$f":"iPCU!B106","v":""},{"$f":"iPCU!C106","v":"P.01.17"},null,0,{"$f":"E112*iPCU!E106","v":0},{"$f":"E112*iPCU!F106","v":0}]
[null,{"$f":"iPCU!B107","v":""},{"$f":"iPCU!C107","v":"P.01.18"},null,0,{"$f":"E113*iPCU!E107","v":0},{"$f":"E113*iPCU!F107","v":0}]
[null,{"$f":"iPCU!B108","v":""},{"$f":"iPCU!C108","v":"P.01.19"},null,0,{"$f":"E114*iPCU!E108","v":0},{"$f":"E114*iPCU!F108","v":0}]
[null,{"$f":"iPCU!B109","v":""},{"$f":"iPCU!C109","v":"P.01.20"},null,0,{"$f":"E115*iPCU!E109","v":0},{"$f":"E115*iPCU!F109","v":0}]
[null,{"$f":"iPCU!B110","v":""},{"$f":"iPCU!C110","v":"P.01.21"},null,0,{"$f":"E116*iPCU!E110","v":0},{"$f":"E116*iPCU!F110","v":0}]
[null,{"$f":"iPCU!B111","v":""},{"$f":"iPCU!C111","v":"P.01.22"},null,0,{"$f":"E117*iPCU!E111","v":0},{"$f":"E117*iPCU!F111","v":0}]
[null,{"$f":"iPCU!B112","v":""},{"$f":"iPCU!C112","v":"P.01.23"},null,0,{"$f":"E118*iPCU!E112","v":0},{"$f":"E118*iPCU!F112","v":0}]
[null,{"$f":"iPCU!B113","v":""},{"$f":"iPCU!C113","v":"P.01.24"},null,0,{"$f":"E119*iPCU!E113","v":0},{"$f":"E119*iPCU!F113","v":0}]
[null,{"$f":"iPCU!B114","v":""},{"$f":"iPCU!C114","v":"P.01.25"},null,0,{"$f":"E120*iPCU!E114","v":0},{"$f":"E120*iPCU!F114","v":0}]
[null,{"$f":"iPCU!B115","v":""},{"$f":"iPCU!C115","v":"P.01.26"},null,0,{"$f":"E121*iPCU!E115","v":0},{"$f":"E121*iPCU!F115","v":0}]
[null,{"$f":"iPCU!B116","v":""},{"$f":"iPCU!C116","v":"P.01.27"},null,0,{"$f":"E122*iPCU!E116","v":0},{"$f":"E122*iPCU!F116","v":0}]
[null,{"$f":"iPCU!B117","v":""},{"$f":"iPCU!C117","v":"P.01.28"},null,0,{"$f":"E123*iPCU!E117","v":0},{"$f":"E123*iPCU!F117","v":0}]
[null,{"$f":"iPCU!B118","v":""},{"$f":"iPCU!C118","v":"P.01.29"},null,0,{"$f":"E124*iPCU!E118","v":0},{"$f":"E124*iPCU!F118","v":0}]
[null,{"$f":"iPCU!B119","v":""},{"$f":"iPCU!C119","v":"P.01.30"},null,0,{"$f":"E125*iPCU!E119","v":0},{"$f":"E125*iPCU!F119","v":0}]
[null,{"$f":"iPCU!B120","v":""},{"$f":"iPCU!C120","v":"P.01.31"},null,0,{"$f":"E126*iPCU!E120","v":0},{"$f":"E126*iPCU!F120","v":0}]
[null,{"$f":"iPCU!B121","v":""},{"$f":"iPCU!C121","v":"P.01.32"},null,0,{"$f":"E127*iPCU!E121","v":0},{"$f":"E127*iPCU!F121","v":0}]
[null,{"$f":"iPCU!B122","v":""},{"$f":"iPCU!C122","v":"P.01.33"},null,0,{"$f":"E128*iPCU!E122","v":0},{"$f":"E128*iPCU!F122","v":0}]
[null,{"$f":"iPCU!B123","v":""},{"$f":"iPCU!C123","v":"P.01.34"},null,0,{"$f":"E129*iPCU!E123","v":0},{"$f":"E129*iPCU!F123","v":0}]
[null,{"$f":"iPCU!B124","v":""},{"$f":"iPCU!C124","v":"P.01.35"},null,0,{"$f":"E130*iPCU!E124","v":0},{"$f":"E130*iPCU!F124","v":0}]
[null,{"$f":"iPCU!B125","v":""},{"$f":"iPCU!C125","v":"P.01.36"},null,0,{"$f":"E131*iPCU!E125","v":0},{"$f":"E131*iPCU!F125","v":0}]
[null,{"$f":"iPCU!B126","v":""},{"$f":"iPCU!C126","v":"P.01.37"},null,0,{"$f":"E132*iPCU!E126","v":0},{"$f":"E132*iPCU!F126","v":0}]
[null,{"$f":"iPCU!B127","v":""},{"$f":"iPCU!C127","v":"P.01.38"},null,0,{"$f":"E133*iPCU!E127","v":0},{"$f":"E133*iPCU!F127","v":0}]
[null,{"$f":"iPCU!B128","v":""},{"$f":"iPCU!C128","v":"P.01.39"},null,0,{"$f":"E134*iPCU!E128","v":0},{"$f":"E134*iPCU!F128","v":0}]
[null,{"$f":"iPCU!B129","v":""},{"$f":"iPCU!C129","v":"P.01.40"},null,0,{"$f":"E135*iPCU!E129","v":0},{"$f":"E135*iPCU!F129","v":0}]
[null,{"$f":"iPCU!B130","v":""},{"$f":"iPCU!C130","v":"P.01.41"},null,0,{"$f":"E136*iPCU!E130","v":0},{"$f":"E136*iPCU!F130","v":0}]
[null,{"$f":"iPCU!B131","v":""},{"$f":"iPCU!C131","v":"P.01.42"},null,0,{"$f":"E137*iPCU!E131","v":0},{"$f":"E137*iPCU!F131","v":0}]
[null,{"$f":"iPCU!B132","v":""},{"$f":"iPCU!C132","v":"P.01.43"},null,0,{"$f":"E138*iPCU!E132","v":0},{"$f":"E138*iPCU!F132","v":0}]
[null,{"$f":"iPCU!B133","v":""},{"$f":"iPCU!C133","v":"P.01.44"},null,0,{"$f":"E139*iPCU!E133","v":0},{"$f":"E139*iPCU!F133","v":0}]
[null,{"$f":"iPCU!B134","v":""},{"$f":"iPCU!C134","v":"P.01.45"},null,0,{"$f":"E140*iPCU!E134","v":0},{"$f":"E140*iPCU!F134","v":0}]
[null,{"$f":"iPCU!B135","v":""},{"$f":"iPCU!C135","v":"P.01.46"},null,0,{"$f":"E141*iPCU!E135","v":0},{"$f":"E141*iPCU!F135","v":0}]
[null,{"$f":"iPCU!B136","v":""},{"$f":"iPCU!C136","v":"P.01.47"},null,0,{"$f":"E142*iPCU!E136","v":0},{"$f":"E142*iPCU!F136","v":0}]
[null,{"$f":"iPCU!B137","v":""},{"$f":"iPCU!C137","v":"P.01.48"},null,0,{"$f":"E143*iPCU!E137","v":0},{"$f":"E143*iPCU!F137","v":0}]
[null,{"$f":"iPCU!B138","v":""},{"$f":"iPCU!C138","v":"P.01.49"},null,0,{"$f":"E144*iPCU!E138","v":0},{"$f":"E144*iPCU!F138","v":0}]
[null,{"$f":"iPCU!B139","v":""},{"$f":"iPCU!C139","v":"P.01.50"},null,0,{"$f":"E145*iPCU!E139","v":0},{"$f":"E145*iPCU!F139","v":0}]
[null,{"$f":"iPCU!B140","v":""},{"$f":"iPCU!C140","v":"P.01.51"},null,0,{"$f":"E146*iPCU!E140","v":0},{"$f":"E146*iPCU!F140","v":0}]
[null,{"$f":"iPCU!B141","v":""},{"$f":"iPCU!C141","v":"P.01.52"},null,0,{"$f":"E147*iPCU!E141","v":0},{"$f":"E147*iPCU!F141","v":0}]
[null,{"$f":"iPCU!B142","v":""},{"$f":"iPCU!C142","v":"P.01.53"},null,0,{"$f":"E148*iPCU!E142","v":0},{"$f":"E148*iPCU!F142","v":0}]
[null,{"$f":"iPCU!B143","v":""},{"$f":"iPCU!C143","v":"P.01.54"},null,0,{"$f":"E149*iPCU!E143","v":0},{"$f":"E149*iPCU!F143","v":0}]
[null,{"$f":"iPCU!B144","v":""},{"$f":"iPCU!C144","v":"P.01.55"},null,0,{"$f":"E150*iPCU!E144","v":0},{"$f":"E150*iPCU!F144","v":0}]
[null,{"$f":"iPCU!B145","v":""},{"$f":"iPCU!C145","v":"P.01.56"},null,0,{"$f":"E151*iPCU!E145","v":0},{"$f":"E151*iPCU!F145","v":0}]
[null,{"$f":"iPCU!B146","v":""},{"$f":"iPCU!C146","v":"P.01.57"},null,0,{"$f":"E152*iPCU!E146","v":0},{"$f":"E152*iPCU!F146","v":0}]
[null,{"$f":"iPCU!B147","v":""},{"$f":"iPCU!C147","v":"P.01.58"},null,0,{"$f":"E153*iPCU!E147","v":0},{"$f":"E153*iPCU!F147","v":0}]
[null,{"$f":"iPCU!B148","v":""},{"$f":"iPCU!C148","v":"P.01.59"},null,0,{"$f":"E154*iPCU!E148","v":0},{"$f":"E154*iPCU!F148","v":0}]
[null,{"$f":"iPCU!B149","v":""},{"$f":"iPCU!C149","v":"P.01.60"},null,0,{"$f":"E155*iPCU!E149","v":0},{"$f":"E155*iPCU!F149","v":0}]
[null,{"$f":"iPCU!B150","v":""},{"$f":"iPCU!C150","v":"P.01.61"},null,0,{"$f":"E156*iPCU!E150","v":0},{"$f":"E156*iPCU!F150","v":0}]
[null,{"$f":"iPCU!B151","v":""},{"$f":"iPCU!C151","v":"P.01.62"},null,0,{"$f":"E157*iPCU!E151","v":0},{"$f":"E157*iPCU!F151","v":0}]
[null,{"$f":"iPCU!B152","v":""},{"$f":"iPCU!C152","v":"P.01.63"},null,0,{"$f":"E158*iPCU!E152","v":0},{"$f":"E158*iPCU!F152","v":0}]
[null,{"$f":"iPCU!B153","v":""},{"$f":"iPCU!C153","v":"P.01.64"},null,0,{"$f":"E159*iPCU!E153","v":0},{"$f":"E159*iPCU!F153","v":0}]
[null,{"$f":"iPCU!B154","v":""},{"$f":"iPCU!C154","v":"P.01.65"},null,0,{"$f":"E160*iPCU!E154","v":0},{"$f":"E160*iPCU!F154","v":0}]
[null,{"$f":"iPCU!B155","v":""},{"$f":"iPCU!C155","v":"P.01.66"},null,0,{"$f":"E161*iPCU!E155","v":0},{"$f":"E161*iPCU!F155","v":0}]
[null,{"$f":"iPCU!B156","v":""},{"$f":"iPCU!C156","v":"P.01.67"},null,0,{"$f":"E162*iPCU!E156","v":0},{"$f":"E162*iPCU!F156","v":0}]
[null,{"$f":"iPCU!B157","v":""},{"$f":"iPCU!C157","v":"P.01.68"},null,0,{"$f":"E163*iPCU!E157","v":0},{"$f":"E163*iPCU!F157","v":0}]
[null,{"$f":"iPCU!B158","v":""},{"$f":"iPCU!C158","v":"P.01.69"},null,0,{"$f":"E164*iPCU!E158","v":0},{"$f":"E164*iPCU!F158","v":0}]
[null,{"$f":"iPCU!B159","v":""},{"$f":"iPCU!C159","v":"P.01.70"},null,0,{"$f":"E165*iPCU!E159","v":0},{"$f":"E165*iPCU!F159","v":0}]
[null,{"$f":"iPCU!B160","v":""},{"$f":"iPCU!C160","v":"P.01.71"},null,0,{"$f":"E166*iPCU!E160","v":0},{"$f":"E166*iPCU!F160","v":0}]
[null,{"$f":"iPCU!B161","v":""},{"$f":"iPCU!C161","v":"P.01.72"},null,0,{"$f":"E167*iPCU!E161","v":0},{"$f":"E167*iPCU!F161","v":0}]
[null,{"$f":"iPCU!B162","v":""},{"$f":"iPCU!C162","v":"P.01.73"},null,0,{"$f":"E168*iPCU!E162","v":0},{"$f":"E168*iPCU!F162","v":0}]
[null,{"$f":"iPCU!B163","v":""},{"$f":"iPCU!C163","v":"P.01.74"},null,0,{"$f":"E169*iPCU!E163","v":0},{"$f":"E169*iPCU!F163","v":0}]
[null,{"$f":"iPCU!B164","v":""},{"$f":"iPCU!C164","v":"P.01.75"},null,0,{"$f":"E170*iPCU!E164","v":0},{"$f":"E170*iPCU!F164","v":0}]
[null,{"$f":"iPCU!B165","v":""},{"$f":"iPCU!C165","v":"P.01.76"},null,0,{"$f":"E171*iPCU!E165","v":0},{"$f":"E171*iPCU!F165","v":0}]
[null,{"$f":"iPCU!B166","v":""},{"$f":"iPCU!C166","v":"P.01.77"},null,0,{"$f":"E172*iPCU!E166","v":0},{"$f":"E172*iPCU!F166","v":0}]
[null,{"$f":"iPCU!B167","v":""},{"$f":"iPCU!C167","v":"P.01.78"},null,0,{"$f":"E173*iPCU!E167","v":0},{"$f":"E173*iPCU!F167","v":0}]
[null,{"$f":"iPCU!B168","v":""},{"$f":"iPCU!C168","v":"P.01.79"},null,0,{"$f":"E174*iPCU!E168","v":0},{"$f":"E174*iPCU!F168","v":0}]
[null,{"$f":"iPCU!B169","v":""},{"$f":"iPCU!C169","v":"P.01.80"},null,0,{"$f":"E175*iPCU!E169","v":0},{"$f":"E175*iPCU!F169","v":0}]
[null,{"$f":"iPCU!B170","v":""},{"$f":"iPCU!C170","v":"P.01.81"},null,0,{"$f":"E176*iPCU!E170","v":0},{"$f":"E176*iPCU!F170","v":0}]
[null,{"$f":"iPCU!B171","v":""},{"$f":"iPCU!C171","v":"P.01.82"},null,0,{"$f":"E177*iPCU!E171","v":0},{"$f":"E177*iPCU!F171","v":0}]
[null,{"$f":"iPCU!B172","v":""},{"$f":"iPCU!C172","v":"P.01.83"},null,0,{"$f":"E178*iPCU!E172","v":0},{"$f":"E178*iPCU!F172","v":0}]
[null,{"$f":"iPCU!B173","v":""},{"$f":"iPCU!C173","v":"P.01.84"},null,0,{"$f":"E179*iPCU!E173","v":0},{"$f":"E179*iPCU!F173","v":0}]
[null,{"$f":"iPCU!B174","v":""},{"$f":"iPCU!C174","v":"P.01.85"},null,0,{"$f":"E180*iPCU!E174","v":0},{"$f":"E180*iPCU!F174","v":0}]
[null,{"$f":"iPCU!B175","v":""},{"$f":"iPCU!C175","v":"P.01.86"},null,0,{"$f":"E181*iPCU!E175","v":0},{"$f":"E181*iPCU!F175","v":0}]
[null,{"$f":"iPCU!B176","v":""},{"$f":"iPCU!C176","v":"P.01.87"},null,0,{"$f":"E182*iPCU!E176","v":0},{"$f":"E182*iPCU!F176","v":0}]
[null,{"$f":"iPCU!B177","v":""},{"$f":"iPCU!C177","v":"P.01.88"},null,0,{"$f":"E183*iPCU!E177","v":0},{"$f":"E183*iPCU!F177","v":0}]
[null,{"$f":"iPCU!B178","v":""},{"$f":"iPCU!C178","v":"P.01.89"},null,0,{"$f":"E184*iPCU!E178","v":0},{"$f":"E184*iPCU!F178","v":0}]
[null,{"$f":"iPCU!B179","v":""},{"$f":"iPCU!C179","v":"P.01.90"},null,0,{"$f":"E185*iPCU!E179","v":0},{"$f":"E185*iPCU!F179","v":0}]
[null,{"$f":"iPCU!B180","v":""},{"$f":"iPCU!C180","v":"P.01.91"},null,0,{"$f":"E186*iPCU!E180","v":0},{"$f":"E186*iPCU!F180","v":0}]
[null,{"$f":"iPCU!B181","v":""},{"$f":"iPCU!C181","v":"P.01.92"},null,0,{"$f":"E187*iPCU!E181","v":0},{"$f":"E187*iPCU!F181","v":0}]
[null,{"$f":"iPCU!B182","v":""},{"$f":"iPCU!C182","v":"P.01.93"},null,0,{"$f":"E188*iPCU!E182","v":0},{"$f":"E188*iPCU!F182","v":0}]
[null,{"$f":"iPCU!B183","v":""},{"$f":"iPCU!C183","v":"P.01.94"},null,0,{"$f":"E189*iPCU!E183","v":0},{"$f":"E189*iPCU!F183","v":0}]
[null,{"$f":"iPCU!B184","v":""},{"$f":"iPCU!C184","v":"P.01.95"},null,0,{"$f":"E190*iPCU!E184","v":0},{"$f":"E190*iPCU!F184","v":0}]
[null,{"$f":"iPCU!B185","v":""},{"$f":"iPCU!C185","v":"P.01.96"},null,0,{"$f":"E191*iPCU!E185","v":0},{"$f":"E191*iPCU!F185","v":0}]
[null,{"$f":"iPCU!B186","v":""},{"$f":"iPCU!C186","v":"P.01.97"},null,0,{"$f":"E192*iPCU!E186","v":0},{"$f":"E192*iPCU!F186","v":0}]
[null,{"$f":"iPCU!B187","v":""},{"$f":"iPCU!C187","v":"P.01.98"},null,0,{"$f":"E193*iPCU!E187","v":0},{"$f":"E193*iPCU!F187","v":0}]
[null,{"$f":"iPCU!B188","v":""},{"$f":"iPCU!C188","v":"P.01.99"},null,0,{"$f":"E194*iPCU!E188","v":0},{"$f":"E194*iPCU!F188","v":0}]
[null,"SPESE PREVENTIVATE DA RIPARTIRE SECONDO LE TABELLE MILLESIMALI",null,null,{"$f":"SUMIFS(E11:E194,D11:D194,\"=?\")","v":4320},{"$f":"SUM(F11:F194)","v":1525},{"$f":"SUM(G11:G194)","v":2795}]
[null,"SPESE PREVENTIVATE DA ASSEGNARE DIRETTAMENTE AI SINGOLI CONDOMINI",null,null,{"$f":"E95","v":0},{"$f":"F95","v":0},{"$f":"G95","v":0},0]
[null,"TOTALE SPESE PREVENTIVATE",null,null,{"$f":"SUM(E102:E196)","v":4320},{"$f":"F96","v":0},{"$f":"G96","v":0}]

{"sheet":"iRP_DEPOSITI","index":14,"n_rows":41,"n_cols":5,"rows_kept":41,"cut":false,"hidden":true,"merged":[]}
[0,"È consentito variare i valori delle sole celle con sfondo bianco."]
[null,{"$f":"iDG!B32","v":"Condominio Palazzo Duck"}]
[null,{"$f":" \"DEPOSITI CAUZIONALI\"","v":"DEPOSITI CAUZIONALI"}]
[null,{"$f":"\"al giorno \" & TEXT(MENÙ!AE9,\"gg-mmm-aaaa\")","v":"al giorno 31-dic-2024"}]
[null,"n.","DEPOSITARIO","CAUSALE","IMPORTO DEPOSITATO"]
[null,1]
[null,2]
[null,3]
[null,4]
[null,5]
[null,6]
[null,7]
[null,8]
[null,9]
[null,10]
[null,11]
[null,12]
[null,13]
[null,14]
[null,15]
[null,null,null,"TOTALE DEPOSITO",{"$f":"SUM(E6:E20)","v":0}]
[null,"DEPOSITI CAUZIONALI"]
[null,{"$f":"\"al giorno 1-gen-\" & iDG!B97 & \" (inizio esercizio)\"","v":"al giorno 1-gen-2024 (inizio esercizio)"}]
[null,"n.","DEPOSITARIO","CAUSALE","IMPORTO DEPOSITATO"]
[null,1]
[null,2]
[null,3]
[null,4]
[null,5]
[null,6]
[null,7]
[null,8]
[null,9]
[null,10]
[null,11]
[null,12]
[null,13]
[null,14]
[null,15]
[null,null,null,"TOTALE DEPOSITO",{"$f":"SUM(E25:E39)","v":0}]
[0]

{"sheet":"iGIORNALE","index":15,"n_rows":531,"n_cols":18,"rows_kept":531,"cut":false,"hidden":true,"merged":[[10,4,10,13],[1,0,1,13],[2,0,2,13],[5,5,5,13],[5,16,5,17],[6,0,6,13],[7,1,8,3],[7,4,8,4],[7,5,7,7],[7,8,7,10],[7,11,7,12],[7,13,8,13]]}
[0,null,null,null,null,null,null,null,null,null,null,null,null,null,0]
["Le celle delle colonne H e K con sfondo in giallo contengono formule e non devono essere mai sovrascritte o variate.\nNel caso appaiono con sfondo bianco, occorre ricopiare in esse la formula e per farlo basta selezionale l'ultima cella in giallo della colonna e trascinare verso il basso in modo da ricopiare la formula sulle celle in bianco.\nLe celle in giallo gialle visualizzano i risultati delle formule solo se nella corrispondente cella di colonna A è riportato un valore non nullo.\nLe celle di colonna M, se presentano uno sfondo celestino, contengono la formula ritenuta la più comune per associare l'importo di una entrata o uscita riportato al conto movimentato.\nLa formula nelle celle della colonna M può essere variata o si può scrivere direttamente il valore, quando l'importo movimentato non corrisponde ad una entrata o uscita scritta sulla stessa riga.\nLa formula originaria può sempre essere riscritta copiando solo la formula dalla cella M10. "]
[]
[]
[{"$f":"iDG!B32","v":"Condominio Palazzo Duck"},null,null,null,null,null,null,null,null,null,null,null,null,null,null,null,null,57]
[null,null,null,null,null,"ATTENZIONE!!!\nI procedimenti guidati forniscono scritture attendibili solo se i prospetti contabili sono aggiornati.\nPrima di utilizzare una scrittura guidata è bene ricalcolare il rendiconto di esercizio e le scritture fiscali.",null,null,null,null,null,null,null,null,null,null,"Calcolo importo singoli conti"]
[{"$f":"\"REGISTRO DELLE OPERAZIONI CONTABILI - ANNO \" & iDG!B97","v":"REGISTRO DELLE OPERAZIONI CONTABILI - ANNO 2024"},null,null,null,null,null,null,null,null,null,null,null,null,null,null,null,"Conto","Importo"]
["Reg.","Data",null,null,"DESCRIZIONE OPERAZIONE (e/o STRINGA INFORMATIVA)","CASSA",null,null,"CONTO CORRENTE",null,null,"MOVIMENTO",null,"Pezza\ngiustificativa ",null,null,{"$f":"\"D.03.01.\"  & RIGHT(iDG!B97,2)","v":"D.03.01.24"},{"$f":"SUMIFS($M$11:M$1517,L$11:L$1517,Q8,M$11:M$1517,\">0\")","v":0}]
["n°",null,null,null,null,"ENTRATA","USCITA","SALDO","ENTRATA","USCITA","SALDO","CONTO","IMPOR.",null,null,null,"U.01.03",{"$f":"SUMIFS($M$11:M$1517,L$11:L$1517,Q9)","v":0}]
[{"$f":"COUNTA(A11:A1517)","v":81},"g","m","a"," TOTALI",{"$f":"ROUND(SUM(F12:F1228),2)","v":20.5},{"$f":"SUM(G12:G1228)","v":16.45},{"$f":"F10-G10","v":4.0500000000000007},{"$f":"ROUND(SUM(I12:I1228),2)","v":20301.22},{"$f":"SUM(J12:J1228)","v":19458.729999999992},{"$f":"I10-J10","v":842.49000000000888},null,{"$f":"IF(LEN(L10)>0,F10+G10+I10+J10,\"\")","v":""},"n°"]
[0,0,0,2024,"=========== SCRITTURE DI APERTURA ESERCIZIO ========== (riporto valori da esercizio precedente)"]
["I",0,0,2024,"LIQUIDITÀ"]
["l",0,0,2024,"SITUAZIONE LIQUIDITÀ INIZIALE (Gestione Ordinaria)",20.5,null,{"$f":"IF(A13<>\"\",IF(INDIRECT(ADDRESS(ROW()-1,8))=\"\",ROUND(SUM(INDIRECT(ADDRESS(ROW()-2,8)),F13,-G13),2),ROUND(SUM(INDIRECT(ADDRESS(ROW()-1,8)),F13,-G13),2)),\"\")","v":20.5},75.209999999999994,null,{"$f":"IF(A13<>\"\",IF(INDIRECT(ADDRESS(ROW()-1,11))=\"\",ROUND(SUM(INDIRECT(ADDRESS(ROW()-2,11)),I13,-J13),2),ROUND(SUM(INDIRECT(ADDRESS(ROW()-1,11)),I13,-J13),2)),\"\")","v":75.209999999999994}]
["l",0,0,2024,"SITUAZIONE LIQUIDITÀ INIZIALE - Gestione speciale - 1",0,null,20.5,8890.7199999999993,null,8965.93]
["l",0,0,2024,"SITUAZIONE LIQUIDITÀ INIZIALE - Gestione speciale - 2",0,null,20.5,0,null,8965.93]
["l",0,0,2024,"SITUAZIONE LIQUIDITÀ INIZIALE - Gestione speciale - 3",0,null,20.5,0,null,8965.93]
["l",0,0,2024,"SITUAZIONE LIQUIDITÀ INIZIALE - Gestione speciale - 4",0,null,20.5,0,null,8965.93]
["l",0,0,2024,"SITUAZIONE LIQUIDITÀ INIZIALE - Gestione speciale - 5",0,null,20.5,0,null,8965.93]
["c",0,0,2024,"CREDITI",null,null,20.5,null,null,8965.93]
["c",0,0,2024,"da CONDOMINI",null,null,20.5,null,null,8965.93]
["c",0,0,2024,"ESERCIZIO 2021",null,null,20.5,null,null,8965.93]
["c",0,0,2024,"Ciccio",null,null,20.5,null,null,8965.93,"C.04.02.21",7.2100000381469727]
["c",0,0,2024,"ESERCIZIO 2022",null,null,20.5,null,null,8965.93]
["c",0,0,2024,"Ciccio",null,null,20.5,null,null,8965.93,"C.04.02.22",4.9000000953674316]
["c",0,0,2024,"ESERCIZIO 2023",null,null,20.5,null,null,8965.93]
["c",0,0,2024,"Paperoga",null,null,20.5,null,null,8965.93,"C.04.01.23",83.709999084472656]
["c",0,0,2024,"Ciccio",null,null,20.5,null,null,8965.93,"C.04.02.23",87.19000244140625]
["c",0,0,2024,"Gastone",null,null,20.5,null,null,8965.93,"C.04.03.23",59.349998474121094]
["c",0,0,2024,"I tre nipotini",null,null,20.5,null,null,8965.93,"C.04.04.23",81.150001525878906]
["d",0,0,2024,"DEBITI",null,null,20.5,null,null,8965.93]
["d",0,0,2024,"v/s CONDOMINI (Quote versate in eccesso)",null,null,20.5,null,null,8965.93]
["d",0,0,2024,"Nonna Papera",null,null,20.5,null,null,8965.93,"D.04.05",119.47998046875]
["d",0,0,2024,"Fidanzati Paperino-Paperina",null,null,20.5,null,null,8965.93,"D.04.06",299.74]
["s",1,1,2024,"OPERAZIONI DI STORNO",null,null,20.5,null,null,8965.93]
["s",1,1,2024,"Restituzione a Nonna Papera",null,null,20.5,null,null,8965.93,"U.01.01.05",119.47998046875]
["s",1,1,2024,"Nonna Papera # Versamento in conto quota esercizio 2024 per storno credito 2023",null,null,20.5,null,null,8965.93,"Q.01.05",119.47998046875]
["s",1,1,2024,"Restituzione a Fidanzati Paperino-Paperina",null,null,20.5,null,null,8965.93,"U.01.01.06",299.74]
["s",1,1,2024,"Fidanzati Paperino-Paperina # Versamento in conto quota esercizio 2024 per storno credito 2023",null,null,20.5,null,null,8965.93,"Q.01.06",299.74]
["e",1,1,2024,"=== SCRITTURE RELATIVE ALL'ESERCIZIO IN CORSO ===",null,null,20.5,null,null,8965.93]
[1,3,1,2024,"Imposta di bollo per Conto BANCOPOSTA Business LINK (dicembre 2023)",null,null,20.5,null,8.49,8957.44,"S.01.09",{"$f":"IF(LEN(L40)>0,F40+G40+I40+J40,\"\")","v":8.49},"1"]
[2,15,1,2024,"USCITE per FACCIATE - Bonifico a impresa EDIL ROCKERDUCK",null,null,20.5,null,7823.68,1133.76,"G.01.01",7823.68,"1"]
[3,16,1,2024,"Canone Conto BANCOPOSTA Business LINK (dicembre 2023)",null,null,20.5,null,12,1121.76,"S.01.09",12,"1"]
[4,16,1,2024,"Fidanzati Paperino-Paperina # Versamento tramite bonifico in conto quota esercizio in corso (2024)",null,null,20.5,500,null,1621.76,"Q.01.06",500,1]
[5,19,1,2024,"Incasso per VERSAMENTO SU GESTIONE SPECIALE -FACCIATE- (conto corrente) (bonifico)- Fidanzati Paperino-Paperina",null,null,20.5,1017.77,null,2639.53,"F.01.02",1017.77,"1"]
[6,20,1,2024,"USCITE per FACCIATE - Bonifico a Arch. Archimede Pitagorico",null,null,20.5,null,500,2139.5300000000002,"G.01.01",500,"1"]
[7,23,1,2024,"Incasso per VERSAMENTO SU GESTIONE SPECIALE -FACCIATE- (conto corrente) (bonifico) - I tre nipotini",null,null,20.5,1657.05,null,3796.58,"F.01.02",1657.05,"1"]
[8,23,1,2024,"Incasso per VERSAMENTO SU GESTIONE SPECIALE -FACCIATE- (conto corrente) (bonifico) - Gastone",null,null,20.5,1287.68,null,5084.26,"F.01.02",1287.68,"1"]
[9,24,1,2024,"USCITE per FACCIATE - Bonifico a impresa EDIL ROCKERDUCK",null,null,20.5,null,4202.4399999999996,881.82,"G.01.01",4202.4399999999996,"1"]
[10,29,1,2024,"Incasso per VERSAMENTO SU GESTIONE SPECIALE -FACCIATE- (conto corrente) (bollettino) - Paperoga",null,null,20.5,241.32,null,1123.1400000000001,"F.01.02",241.32,"1"]
[11,29,1,2024,"Spese personali accredito bollettino conto corrente Paperoga",null,null,20.5,null,0.34,1122.8,"P.01.01",0.34,"1"]
[12,2,2,2024,"Imposta di bollo per Conto BANCOPOSTA Business LINK (gennaio 2024)",null,null,20.5,null,8.4600000000000009,1114.3399999999999,"S.01.09",8.4600000000000009,"2"]
[13,2,2,2024,"Bolletta PAPERO ENERGIA n. 2013787201(dic-2023)",null,null,20.5,null,105.74,1008.6,null,null,"2"]
[13,2,2,2024,"ENERGIA ILLUMINAZIONE (20%)",null,null,20.5,null,null,1008.6,"S.04.01",21.15,"2--3"]
[13,2,2,2024,"ENERGIA ALIMENTAZIONE ASCENSORE",null,null,20.5,null,null,1008.6,"S.04.02",84.59,"2--3"]
[13,2,2,2024,"ENERGIA ALIMENTAZIONE IMPIANTO TV",null,null,20.5,null,null,1008.6,"S.04.03",0,"2--3"]
[14,5,2,2024,"Pagata Fattura Canone  13/24 IL PAPERO ASCENSORI srl 1° SEMESTRE Manutenzione Ascensore",null,null,20.5,null,254.4,754.2,"S.03.01",264,"2--4"]
[14,5,2,2024,"01 # F # 13/24 # 26-01-2024 # 00",null,null,20.5,null,null,754.2,"H.P04.01",240,"2--4"]
[14,5,2,2024,"v/s ERARIO # R.A. su pag. fatt. IL PAPERO ASCENSORI 13/24 # 01 # A-01 # 05-02-2024",null,null,20.5,null,null,754.2,"D.03.01.23",9.6,"2--4"]
[15,5,2,2024,"F24-Vers. R.A. su pag. fatt. IL PAPERO ASCENSORI 13/24",null,null,20.5,null,9.6,744.6,null,null,"2--5"]
[15,5,2,2024,"Si estingue il debito v/s ERARIO # 01",null,null,20.5,null,null,744.6,"D.03.01.23",-9.6,"2--5"]
[15,5,2,2024,"01 # F # 13/24 # 26-01-2024 # 00",null,null,20.5,null,null,744.6,"H.R04.01",9.6,"2--5"]
[16,6,2,2024,"Fidanzati Paperino-Paperina # Versamento tramite bonifico in conto quota esercizio in corso (2024)",null,null,20.5,371.16,null,1115.76,"Q.01.06",{"$f":"IF(LEN(L62)>0,F62+G62+I62+J62,\"\")","v":371.16},2]
[17,6,2,2024,"Incasso per VERSAMENTO SU GESTIONE SPECIALE -FACCIATE- (conto corrente) (bonifico)- Fidanzati Paperino-Paperina",null,null,20.5,128.84,null,1244.5999999999999,"F.01.02",128.84,"2"]
[18,12,2,2024,"Incasso per VERSAMENTO SU GESTIONE SPECIALE -FACCIATE- (conto corrente) (bonifico) - Nonna Papera",null,null,20.5,3470.63,null,4715.2299999999996,"F.01.02",3470.63,"2"]
[19,13,2,2024,"USCITE per FACCIATE - Bonifico a impresa EDIL ROCKERDUCK",null,null,20.5,null,4121.51,593.72,"G.01.01",4121.51,"2"]
[20,20,2,2024,"Canone Conto BANCOPOSTA Business LINK (gennaio 2024)",null,null,20.5,null,12,581.72,"S.01.09",12,"6"]
[21,2,3,2024,"Imposta di bollo per Conto BANCOPOSTA Business LINK (febbraio 2024)",null,null,20.5,null,7.92,573.79999999999995,"S.01.09",7.92,"6"]
[22,5,3,2024,"Incasso per VERSAMENTO SU GESTIONE SPECIALE -FACCIATE- (conto corrente) (bonifico) - I tre Nipotini",null,null,20.5,1454.42,null,2028.22,"F.01.02",1454.42,"6"]
[23,21,3,2024,"Incasso per VERSAMENTO SU GESTIONE SPECIALE -FACCIATE- (conto corrente) (bonifico)- Fidanzati Paperino-Paperina",null,null,20.5,400,null,2428.2199999999998,"F.01.02",400,"6"]
[24,26,3,2024,"USCITE per FACCIATE - Bonifico a ditta EURO METAL",null,null,20.5,null,440,1988.22,"G.01.01",440,"6"]
[25,27,3,2024,"Canone Conto BANCOPOSTA Business LINK (febbraio 2024)",null,null,20.5,null,12,1976.22,"S.01.09",12,"6"]
[26,27,3,2024,"Restituzione da GESTIONE SPECIALE -FACCIATE- (conto corrente)  Nonna Papera",null,null,20.5,null,6.42,1969.8,"F.01.02",-6.42]
[27,31,3,2024,"Nonna Papera # Versamento in conto quota esercizio in corso (2024) -storno da fondo facciate",null,null,20.5,6.42,null,1976.22,"Q.01.05",6.42]
[27,2,4,2024,"Bolletta PAPERO ENERGIA n. 2013995517(gen-feb-2024)",null,null,20.5,null,212.62,1763.6]
[27,2,4,2024,"ENERGIA ILLUMINAZIONE (20%)",null,null,20.5,null,null,1763.6,"S.04.01",42.52,"7--8"]
[27,2,4,2024,"ENERGIA ALIMENTAZIONE ASCENSORE",null,null,20.5,null,null,1763.6,"S.04.02",170.1,"7--8"]
[27,2,4,2024,"ENERGIA ALIMENTAZIONE IMPIANTO TV",null,null,{"$f":"IF(A77<>\"\",IF(INDIRECT(ADDRESS(ROW()-1,8))=\"\",ROUND(SUM(INDIRECT(ADDRESS(ROW()-2,8)),F77,-G77),2),ROUND(SUM(INDIRECT(ADDRESS(ROW()-1,8)),F77,-G77),2)),\"\")","v":20.5},null,null,{"$f":"IF(A77<>\"\",IF(INDIRECT(ADDRESS(ROW()-1,11))=\"\",ROUND(SUM(INDIRECT(ADDRESS(ROW()-2,11)),I77,-J77),2),ROUND(SUM(INDIRECT(ADDRESS(ROW()-1,11)),I77,-J77),2)),\"\")","v":1763.6},"S.04.03",0,"7--8"]
[28,3,4,2024,"Imposta di bollo per Conto BANCOPOSTA Business LINK (marzo 2024)",null,null,20.5,null,8.4600000000000009,1755.14,"S.01.09",{"$f":"IF(LEN(L78)>0,F78+G78+I78+J78,\"\")","v":8.4600000000000009},"7"]
[29,22,4,2024,"Spese raccomandata di diffida pagamento contributi condominiali a Ciccio",null,6.8,13.7,null,null,1755.14,"P.01.02",6.8,"9"]
[30,23,4,2024,"Canone Conto BANCOPOSTA Business LINK (marzo 2024)",null,null,13.7,null,12,1743.14,"S.01.09",12,"7"]
[31,3,5,2024,"Imposta di bollo per Conto BANCOPOSTA Business LINK (aprile 2024)",null,null,13.7,null,8.19,1734.95,"S.01.09",8.19,"10"]
[32,24,5,2024,"Canone Conto BANCOPOSTA Business LINK (aprile 2024)",null,null,13.7,null,12,1722.95,"S.01.09",12,"10"]
[33,27,5,2024,"Spese raccomandata convocazione assemblea condominiale a Ciccio",null,9.65,4.05,null,null,1722.95,"P.01.02",9.65,"11"]
[34,30,5,2024,"USCITE per FACCIATE - Bonifico a impresa EDIL ROCKERDUCK",null,null,4.05,null,1454.38,268.57,"G.01.01",1454.38,"10"]
[35,31,5,2024,"Fidanzati Paperino-Paperina # Versamento tramite bonifico in conto quota esercizio in corso (2024)",null,null,4.05,300,null,568.57000000000005,"Q.01.06",300,10]
[36,3,5,2024,"Imposta di bollo per Conto BANCOPOSTA Business LINK (maggio 2024)",null,null,4.05,null,8.4600000000000009,560.11,"S.01.09",8.4600000000000009]
[37,5,6,2024,"Bolletta PAPERO ENERGIA n. 2014186132(mar-apr-2024)",null,null,4.05,null,217.62,342.49]
[37,5,6,2024,"ENERGIA ILLUMINAZIONE (20%)",null,null,4.05,null,null,342.49,"S.04.01",43.52,"12"]
[37,5,6,2024,"ENERGIA ALIMENTAZIONE ASCENSORE",null,null,4.05,null,null,342.49,"S.04.02",174.1,"12"]
[37,5,6,2024,"ENERGIA ALIMENTAZIONE IMPIANTO TV",null,null,4.05,null,null,342.49,"S.04.03",0,"12"]
[38,6,6,2024,"Fidanzati Paperino-Paperina # Versamento tramite bonifico in conto quota esercizio in corso (2024)",null,null,4.05,500,null,842.49,"Q.01.06",{"$f":"IF(LEN(L91)>0,F91+G91+I91+J91,\"\")","v":500}]
[null,null,null,null,null,null,null,{"$f":"IF(A92<>\"\",IF(INDIRECT(ADDRESS(ROW()-1,8))=\"\",ROUND(SUM(INDIRECT(ADDRESS(ROW()-2,8)),F92,-G92),2),ROUND(SUM(INDIRECT(ADDRESS(ROW()-1,8)),F92,-G92),2)),\"\")","v":""},null,null,{"$f":"IF(A92<>\"\",IF(INDIRECT(ADDRESS(ROW()-1,11))=\"\",ROUND(SUM(INDIRECT(ADDRESS(ROW()-2,11)),I92,-J92),2),ROUND(SUM(INDIRECT(ADDRESS(ROW()-1,11)),I92,-J92),2)),\"\")","v":""}]
[null,null,null,null,null,null,null,{"$f":"IF(A93<>\"\",IF(INDIRECT(ADDRESS(ROW()-1,8))=\"\",ROUND(SUM(INDIRECT(ADDRESS(ROW()-2,8)),F93,-G93),2),ROUND(SUM(INDIRECT(ADDRESS(ROW()-1,8)),F93,-G93),2)),\"\")","v":""},null,null,{"$f":"IF(A93<>\"\",IF(INDIRECT(ADDRESS(ROW()-1,11))=\"\",ROUND(SUM(INDIRECT(ADDRESS(ROW()-2,11)),I93,-J93),2),ROUND(SUM(INDIRECT(ADDRESS(ROW()-1,11)),I93,-J93),2)),\"\")","v":""}]
[null,null,null,null,null,null,null,"",null,null,""]
[null,null,null,null,null,null,null,"",null,null,""]
[null,null,null,null,null,null,null,"",null,null,""]
[null,null,null,null,null,null,null,"",null,null,""]
[null,null,null,null,null,null,null,"",null,null,""]
[null,null,null,null,null,null,null,"",null,null,""]
[null,null,null,null,null,null,null,"",null,null,""]
[null,null,null,null,null,null,null,"",null,null,""]
[null,null,null,null,null,null,null,"",null,null,""]
[null,null,null,null,null,null,null,"",null,null,""]
[null,null,null,null,null,null,null,"",null,null,""]
[null,null,null,null,null,null,null,"",null,null,""]
[null,null,null,null,null,null,null,"",null,null,""]
[null,null,null,null,null,null,null,"",null,null,""]
[null,null,null,null,null,null,null,"",null,null,""]
[null,null,null,null,null,null,null,"",null,null,""]
[null,null,null,null,null,null,null,"",null,null,""]
[null,null,null,null,null,null,null,"",null,null,""]
[null,null,null,null,null,null,null,"",null,null,""]
[null,null,null,null,null,null,null,"",null,null,""]
[null,null,null,null,null,null,null,"",null,null,""]
[null,null,null,null,null,null,null,"",null,null,""]
[null,null,null,null,null,null,null,"",null,null,""]
[null,null,null,null,null,null,null,"",null,null,""]
[null,null,null,null,null,null,null,"",null,null,""]
[null,null,null,null,null,null,null,"",null,null,""]
[null,null,null,null,null,null,null,"",null,null,""]
[null,null,null,null,null,null,null,"",null,null,""]
[null,null,null,null,null,null,null,"",null,null,""]
[null,null,null,null,null,null,null,"",null,null,""]
[null,null,null,null,null,null,null,"",null,null,""]
[null,null,null,null,null,null,null,"",null,null,""]
[null,null,null,null,null,null,null,"",null,null,""]
[null,null,null,null,null,null,null,"",null,null,""]
[null,null,null,null,null,null,null,"",null,null,""]
[null,null,null,null,null,null,null,"",null,null,""]
[null,null,null,null,null,null,null,"",null,null,""]
[null,null,null,null,null,null,null,"",null,null,""]
[null,null,null,null,null,null,null,"",null,null,""]
[null,null,null,null,null,null,null,"",null,null,""]
[null,null,null,null,null,null,null,"",null,null,""]
[null,null,null,null,null,null,null,"",null,null,""]
[null,null,null,null,null,null,null,"",null,null,""]
[null,null,null,null,null,null,null,"",null,null,""]
[null,null,null,null,null,null,null,"",null,null,""]
[null,null,null,null,null,null,null,"",null,null,""]
[null,null,null,null,null,null,null,"",null,null,""]
[null,null,null,null,null,null,null,"",null,null,""]
[null,null,null,null,null,null,null,"",null,null,""]
[null,null,null,null,null,null,null,"",null,null,""]
[null,null,null,null,null,null,null,"",null,null,""]
[null,null,null,null,null,null,null,"",null,null,""]
[null,null,null,null,null,null,null,"",null,null,""]
[null,null,null,null,null,null,null,"",null,null,""]
[null,null,null,null,null,null,null,"",null,null,""]
[null,null,null,null,null,null,null,"",null,null,""]
[null,null,null,null,null,null,null,"",null,null,""]
[null,null,null,null,null,null,null,"",null,null,""]
[null,null,null,null,null,null,null,"",null,null,""]
[null,null,null,null,null,null,null,"",null,null,""]
[null,null,null,null,null,null,null,"",null,null,""]
[null,null,null,null,null,null,null,"",null,null,""]
[null,null,null,null,null,null,null,"",null,null,""]
[null,null,null,null,null,null,null,{"$f":"IF(A157<>\"\",IF(INDIRECT(ADDRESS(ROW()-1,8))=\"\",ROUND(SUM(INDIRECT(ADDRESS(ROW()-2,8)),F157,-G157),2),ROUND(SUM(INDIRECT(ADDRESS(ROW()-1,8)),F157,-G157),2)),\"\")","v":""},null,null,{"$f":"IF(A157<>\"\",IF(INDIRECT(ADDRESS(ROW()-1,11))=\"\",ROUND(SUM(INDIRECT(ADDRESS(ROW()-2,11)),I157,-J157),2),ROUND(SUM(INDIRECT(ADDRESS(ROW()-1,11)),I157,-J157),2)),\"\")","v":""}]
[null,null,null,null,null,null,null,"",null,null,""]
[null,null,null,null,null,null,null,"",null,null,""]
[null,null,null,null,null,null,null,"",null,null,""]
[null,null,null,null,null,null,null,"",null,null,""]
[null,null,null,null,null,null,null,"",null,null,""]
[null,null,null,null,null,null,null,"",null,null,""]
[null,null,null,null,null,null,null,"",null,null,""]
[null,null,null,null,null,null,null,"",null,null,""]
[null,null,null,null,null,null,null,"",null,null,""]
[null,null,null,null,null,null,null,"",null,null,""]
[null,null,null,null,null,null,null,"",null,null,""]
[null,null,null,null,null,null,null,"",null,null,""]
[null,null,null,null,null,null,null,"",null,null,""]
[null,null,null,null,null,null,null,"",null,null,""]
[null,null,null,null,null,null,null,"",null,null,""]
[null,null,null,null,null,null,null,"",null,null,""]
[null,null,null,null,null,null,null,"",null,null,""]
[null,null,null,null,null,null,null,"",null,null,""]
[null,null,null,null,null,null,null,"",null,null,""]
[null,null,null,null,null,null,null,"",null,null,""]
[null,null,null,null,null,null,null,"",null,null,""]
[null,null,null,null,null,null,null,"",null,null,""]
[null,null,null,null,null,null,null,"",null,null,""]
[null,null,null,null,null,null,null,"",null,null,""]
[null,null,null,null,null,null,null,"",null,null,""]
[null,null,null,null,null,null,null,"",null,null,""]
[null,null,null,null,null,null,null,"",null,null,""]
[null,null,null,null,null,null,null,"",null,null,""]
[null,null,null,null,null,null,null,"",null,null,""]
[null,null,null,null,null,null,null,"",null,null,""]
[null,null,null,null,null,null,null,"",null,null,""]
[null,null,null,null,null,null,null,"",null,null,""]
[null,null,null,null,null,null,null,"",null,null,""]
[null,null,null,null,null,null,null,"",null,null,""]
[null,null,null,null,null,null,null,"",null,null,""]
[null,null,null,null,null,null,null,"",null,null,""]
[null,null,null,null,null,null,null,"",null,null,""]
[null,null,null,null,null,null,null,"",null,null,""]
[null,null,null,null,null,null,null,"",null,null,""]
[null,null,null,null,null,null,null,"",null,null,""]
[null,null,null,null,null,null,null,"",null,null,""]
[null,null,null,null,null,null,null,"",null,null,""]
[null,null,null,null,null,null,null,"",null,null,""]
[null,null,null,null,null,null,null,"",null,null,""]
[null,null,null,null,null,null,null,"",null,null,""]
[null,null,null,null,null,null,null,"",null,null,""]
[null,null,null,null,null,null,null,"",null,null,""]
[null,null,null,null,null,null,null,"",null,null,""]
[null,null,null,null,null,null,null,"",null,null,""]
[null,null,null,null,null,null,null,"",null,null,""]
[null,null,null,null,null,null,null,"",null,null,""]
[null,null,null,null,null,null,null,"",null,null,""]
[null,null,null,null,null,null,null,"",null,null,""]
[null,null,null,null,null,null,null,"",null,null,""]
[null,null,null,null,null,null,null,"",null,null,""]
[null,null,null,null,null,null,null,"",null,null,""]
[null,null,null,null,null,null,null,"",null,null,""]
[null,null,null,null,null,null,null,"",null,null,""]
[null,null,null,null,null,null,null,"",null,null,""]
[null,null,null,null,null,null,null,"",null,null,""]
[null,null,null,null,null,null,null,"",null,null,""]
[null,null,null,null,null,null,null,"",null,null,""]
[null,null,null,null,null,null,null,"",null,null,""]
[null,null,null,null,null,null,null,{"$f":"IF(A221<>\"\",IF(INDIRECT(ADDRESS(ROW()-1,8))=\"\",ROUND(SUM(INDIRECT(ADDRESS(ROW()-2,8)),F221,-G221),2),ROUND(SUM(INDIRECT(ADDRESS(ROW()-1,8)),F221,-G221),2)),\"\")","v":""},null,null,{"$f":"IF(A221<>\"\",IF(INDIRECT(ADDRESS(ROW()-1,11))=\"\",ROUND(SUM(INDIRECT(ADDRESS(ROW()-2,11)),I221,-J221),2),ROUND(SUM(INDIRECT(ADDRESS(ROW()-1,11)),I221,-J221),2)),\"\")","v":""}]
[null,null,null,null,null,null,null,"",null,null,""]
[null,null,null,null,null,null,null,"",null,null,""]
[null,null,null,null,null,null,null,"",null,null,""]
[null,null,null,null,null,null,null,"",null,null,""]
[null,null,null,null,null,null,null,"",null,null,""]
[null,null,null,null,null,null,null,"",null,null,""]
[null,null,null,null,null,null,null,"",null,null,""]
[null,null,null,null,null,null,null,"",null,null,""]
[null,null,null,null,null,null,null,"",null,null,""]
[null,null,null,null,null,null,null,"",null,null,""]
[null,null,null,null,null,null,null,"",null,null,""]
[null,null,null,null,null,null,null,"",null,null,""]
[null,null,null,null,null,null,null,"",null,null,""]
[null,null,null,null,null,null,null,"",null,null,""]
[null,null,null,null,null,null,null,"",null,null,""]
[null,null,null,null,null,null,null,"",null,null,""]
[null,null,null,null,null,null,null,"",null,null,""]
[null,null,null,null,null,null,null,"",null,null,""]
[null,null,null,null,null,null,null,"",null,null,""]
[null,null,null,null,null,null,null,"",null,null,""]
[null,null,null,null,null,null,null,"",null,null,""]
[null,null,null,null,null,null,null,"",null,null,""]
[null,null,null,null,null,null,null,"",null,null,""]
[null,null,null,null,null,null,null,"",null,null,""]
[null,null,null,null,null,null,null,"",null,null,""]
[null,null,null,null,null,null,null,"",null,null,""]
[null,null,null,null,null,null,null,"",null,null,""]
[null,null,null,null,null,null,null,"",null,null,""]
[null,null,null,null,null,null,null,"",null,null,""]
[null,null,null,null,null,null,null,"",null,null,""]
[null,null,null,null,null,null,null,"",null,null,""]
[null,null,null,null,null,null,null,"",null,null,""]
[null,null,null,null,null,null,null,"",null,null,""]
[null,null,null,null,null,null,null,"",null,null,""]
[null,null,null,null,null,null,null,"",null,null,""]
[null,null,null,null,null,null,null,"",null,null,""]
[null,null,null,null,null,null,null,"",null,null,""]
[null,null,null,null,null,null,null,"",null,null,""]
[null,null,null,null,null,null,null,"",null,null,""]
[null,null,null,null,null,null,null,"",null,null,""]
[null,null,null,null,null,null,null,"",null,null,""]
[null,null,null,null,null,null,null,"",null,null,""]
[null,null,null,null,null,null,null,"",null,null,""]
[null,null,null,null,null,null,null,"",null,null,""]
[null,null,null,null,null,null,null,"",null,null,""]
[null,null,null,null,null,null,null,"",null,null,""]
[null,null,null,null,null,null,null,"",null,null,""]
[null,null,null,null,null,null,null,"",null,null,""]
[null,null,null,null,null,null,null,"",null,null,""]
[null,null,null,null,null,null,null,"",null,null,""]
[null,null,null,null,null,null,null,"",null,null,""]
[null,null,null,null,null,null,null,"",null,null,""]
[null,null,null,null,null,null,null,"",null,null,""]
[null,null,null,null,null,null,null,"",null,null,""]
[null,null,null,null,null,null,null,"",null,null,""]
[null,null,null,null,null,null,null,"",null,null,""]
[null,null,null,null,null,null,null,"",null,null,""]
[null,null,null,null,null,null,null,"",null,null,""]
[null,null,null,null,null,null,null,"",null,null,""]
[null,null,null,null,null,null,null,"",null,null,""]
[null,null,null,null,null,null,null,"",null,null,""]
[null,null,null,null,null,null,null,"",null,null,""]
[null,null,null,null,null,null,null,"",null,null,""]
[null,null,null,null,null,null,null,{"$f":"IF(A285<>\"\",IF(INDIRECT(ADDRESS(ROW()-1,8))=\"\",ROUND(SUM(INDIRECT(ADDRESS(ROW()-2,8)),F285,-G285),2),ROUND(SUM(INDIRECT(ADDRESS(ROW()-1,8)),F285,-G285),2)),\"\")","v":""},null,null,{"$f":"IF(A285<>\"\",IF(INDIRECT(ADDRESS(ROW()-1,11))=\"\",ROUND(SUM(INDIRECT(ADDRESS(ROW()-2,11)),I285,-J285),2),ROUND(SUM(INDIRECT(ADDRESS(ROW()-1,11)),I285,-J285),2)),\"\")","v":""}]
[null,null,null,null,null,null,null,"",null,null,""]
[null,null,null,null,null,null,null,"",null,null,""]
[null,null,null,null,null,null,null,"",null,null,""]
[null,null,null,null,null,null,null,"",null,null,""]
[null,null,null,null,null,null,null,"",null,null,""]
[null,null,null,null,null,null,null,"",null,null,""]
[null,null,null,null,null,null,null,"",null,null,""]
[null,null,null,null,null,null,null,"",null,null,""]
[null,null,null,null,null,null,null,"",null,null,""]
[null,null,null,null,null,null,null,"",null,null,""]
[null,null,null,null,null,null,null,"",null,null,""]
[null,null,null,null,null,null,null,"",null,null,""]
[null,null,null,null,null,null,null,"",null,null,""]
[null,null,null,null,null,null,null,"",null,null,""]
[null,null,null,null,null,null,null,"",null,null,""]
[null,null,null,null,null,null,null,"",null,null,""]
[null,null,null,null,null,null,null,"",null,null,""]
[null,null,null,null,null,null,null,"",null,null,""]
[null,null,null,null,null,null,null,"",null,null,""]
[null,null,null,null,null,null,null,"",null,null,""]
[null,null,null,null,null,null,null,"",null,null,""]
[null,null,null,null,null,null,null,"",null,null,""]
[null,null,null,null,null,null,null,"",null,null,""]
[null,null,null,null,null,null,null,"",null,null,""]
[null,null,null,null,null,null,null,"",null,null,""]
[null,null,null,null,null,null,null,"",null,null,""]
[null,null,null,null,null,null,null,"",null,null,""]
[null,null,null,null,null,null,null,"",null,null,""]
[null,null,null,null,null,null,null,"",null,null,""]
[null,null,null,null,null,null,null,"",null,null,""]
[null,null,null,null,null,null,null,"",null,null,""]
[null,null,null,null,null,null,null,"",null,null,""]
[null,null,null,null,null,null,null,"",null,null,""]
[null,null,null,null,null,null,null,"",null,null,""]
[null,null,null,null,null,null,null,"",null,null,""]
[null,null,null,null,null,null,null,"",null,null,""]
[null,null,null,null,null,null,null,"",null,null,""]
[null,null,null,null,null,null,null,"",null,null,""]
[null,null,null,null,null,null,null,"",null,null,""]
[null,null,null,null,null,null,null,"",null,null,""]
[null,null,null,null,null,null,null,"",null,null,""]
[null,null,null,null,null,null,null,"",null,null,""]
[null,null,null,null,null,null,null,"",null,null,""]
[null,null,null,null,null,null,null,"",null,null,""]
[null,null,null,null,null,null,null,"",null,null,""]
[null,null,null,null,null,null,null,"",null,null,""]
[null,null,null,null,null,null,null,"",null,null,""]
[null,null,null,null,null,null,null,"",null,null,""]
[null,null,null,null,null,null,null,"",null,null,""]
[null,null,null,null,null,null,null,"",null,null,""]
[null,null,null,null,null,null,null,"",null,null,""]
[null,null,null,null,null,null,null,"",null,null,""]
[null,null,null,null,null,null,null,"",null,null,""]
[null,null,null,null,null,null,null,"",null,null,""]
[null,null,null,null,null,null,null,"",null,null,""]
[null,null,null,null,null,null,null,"",null,null,""]
[null,null,null,null,null,null,null,"",null,null,""]
[null,null,null,null,null,null,null,"",null,null,""]
[null,null,null,null,null,null,null,"",null,null,""]
[null,null,null,null,null,null,null,"",null,null,""]
[null,null,null,null,null,null,null,"",null,null,""]
[null,null,null,null,null,null,null,"",null,null,""]
[null,null,null,null,null,null,null,"",null,null,""]
[null,null,null,null,null,null,null,{"$f":"IF(A349<>\"\",IF(INDIRECT(ADDRESS(ROW()-1,8))=\"\",ROUND(SUM(INDIRECT(ADDRESS(ROW()-2,8)),F349,-G349),2),ROUND(SUM(INDIRECT(ADDRESS(ROW()-1,8)),F349,-G349),2)),\"\")","v":""},null,null,{"$f":"IF(A349<>\"\",IF(INDIRECT(ADDRESS(ROW()-1,11))=\"\",ROUND(SUM(INDIRECT(ADDRESS(ROW()-2,11)),I349,-J349),2),ROUND(SUM(INDIRECT(ADDRESS(ROW()-1,11)),I349,-J349),2)),\"\")","v":""}]
[null,null,null,null,null,null,null,"",null,null,""]
[null,null,null,null,null,null,null,"",null,null,""]
[null,null,null,null,null,null,null,"",null,null,""]
[null,null,null,null,null,null,null,"",null,null,""]
[null,null,null,null,null,null,null,"",null,null,""]
[null,null,null,null,null,null,null,"",null,null,""]
[null,null,null,null,null,null,null,"",null,null,""]
[null,null,null,null,null,null,null,"",null,null,""]
[null,null,null,null,null,null,null,"",null,null,""]
[null,null,null,null,null,null,null,"",null,null,""]
[null,null,null,null,null,null,null,"",null,null,""]
[null,null,null,null,null,null,null,"",null,null,""]
[null,null,null,null,null,null,null,"",null,null,""]
[null,null,null,null,null,null,null,"",null,null,""]
[null,null,null,null,null,null,null,"",null,null,""]
[null,null,null,null,null,null,null,"",null,null,""]
[null,null,null,null,null,null,null,"",null,null,""]
[null,null,null,null,null,null,null,"",null,null,""]
[null,null,null,null,null,null,null,"",null,null,""]
[null,null,null,null,null,null,null,"",null,null,""]
[null,null,null,null,null,null,null,"",null,null,""]
[null,null,null,null,null,null,null,"",null,null,""]
[null,null,null,null,null,null,null,"",null,null,""]
[null,null,null,null,null,null,null,"",null,null,""]
[null,null,null,null,null,null,null,"",null,null,""]
[null,null,null,null,null,null,null,"",null,null,""]
[null,null,null,null,null,null,null,"",null,null,""]
[null,null,null,null,null,null,null,"",null,null,""]
[null,null,null,null,null,null,null,"",null,null,""]
[null,null,null,null,null,null,null,"",null,null,""]
[null,null,null,null,null,null,null,"",null,null,""]
[null,null,null,null,null,null,null,"",null,null,""]
[null,null,null,null,null,null,null,"",null,null,""]
[null,null,null,null,null,null,null,"",null,null,""]
[null,null,null,null,null,null,null,"",null,null,""]
[null,null,null,null,null,null,null,"",null,null,""]
[null,null,null,null,null,null,null,"",null,null,""]
[null,null,null,null,null,null,null,"",null,null,""]
[null,null,null,null,null,null,null,"",null,null,""]
[null,null,null,null,null,null,null,"",null,null,""]
[null,null,null,null,null,null,null,"",null,null,""]
[null,null,null,null,null,null,null,"",null,null,""]
[null,null,null,null,null,null,null,"",null,null,""]
[null,null,null,null,null,null,null,"",null,null,""]
[null,null,null,null,null,null,null,"",null,null,""]
[null,null,null,null,null,null,null,"",null,null,""]
[null,null,null,null,null,null,null,"",null,null,""]
[null,null,null,null,null,null,null,"",null,null,""]
[null,null,null,null,null,null,null,"",null,null,""]
[null,null,null,null,null,null,null,"",null,null,""]
[null,null,null,null,null,null,null,"",null,null,""]
[null,null,null,null,null,null,null,"",null,null,""]
[null,null,null,null,null,null,null,"",null,null,""]
[null,null,null,null,null,null,null,"",null,null,""]
[null,null,null,null,null,null,null,"",null,null,""]
[null,null,null,null,null,null,null,"",null,null,""]
[null,null,null,null,null,null,null,"",null,null,""]
[null,null,null,null,null,null,null,"",null,null,""]
[null,null,null,null,null,null,null,"",null,null,""]
[null,null,null,null,null,null,null,"",null,null,""]
[null,null,null,null,null,null,null,"",null,null,""]
[null,null,null,null,null,null,null,"",null,null,""]
[null,null,null,null,null,null,null,"",null,null,""]
[null,null,null,null,null,null,null,{"$f":"IF(A413<>\"\",IF(INDIRECT(ADDRESS(ROW()-1,8))=\"\",ROUND(SUM(INDIRECT(ADDRESS(ROW()-2,8)),F413,-G413),2),ROUND(SUM(INDIRECT(ADDRESS(ROW()-1,8)),F413,-G413),2)),\"\")","v":""},null,null,{"$f":"IF(A413<>\"\",IF(INDIRECT(ADDRESS(ROW()-1,11))=\"\",ROUND(SUM(INDIRECT(ADDRESS(ROW()-2,11)),I413,-J413),2),ROUND(SUM(INDIRECT(ADDRESS(ROW()-1,11)),I413,-J413),2)),\"\")","v":""}]
[null,null,null,null,null,null,null,"",null,null,""]
[null,null,null,null,null,null,null,"",null,null,""]
[null,null,null,null,null,null,null,"",null,null,""]
[null,null,null,null,null,null,null,"",null,null,""]
[null,null,null,null,null,null,null,"",null,null,""]
[null,null,null,null,null,null,null,"",null,null,""]
[null,null,null,null,null,null,null,"",null,null,""]
[null,null,null,null,null,null,null,"",null,null,""]
[null,null,null,null,null,null,null,"",null,null,""]
[null,null,null,null,null,null,null,"",null,null,""]
[null,null,null,null,null,null,null,"",null,null,""]
[null,null,null,null,null,null,null,"",null,null,""]
[null,null,null,null,null,null,null,"",null,null,""]
[null,null,null,null,null,null,null,"",null,null,""]
[null,null,null,null,null,null,null,"",null,null,""]
[null,null,null,null,null,null,null,"",null,null,""]
[null,null,null,null,null,null,null,"",null,null,""]
[null,null,null,null,null,null,null,"",null,null,""]
[null,null,null,null,null,null,null,"",null,null,""]
[null,null,null,null,null,null,null,"",null,null,""]
[null,null,null,null,null,null,null,"",null,null,""]
[null,null,null,null,null,null,null,"",null,null,""]
[null,null,null,null,null,null,null,"",null,null,""]
[null,null,null,null,null,null,null,"",null,null,""]
[null,null,null,null,null,null,null,"",null,null,""]
[null,null,null,null,null,null,null,"",null,null,""]
[null,null,null,null,null,null,null,"",null,null,""]
[null,null,null,null,null,null,null,"",null,null,""]
[null,null,null,null,null,null,null,"",null,null,""]
[null,null,null,null,null,null,null,"",null,null,""]
[null,null,null,null,null,null,null,"",null,null,""]
[null,null,null,null,null,null,null,"",null,null,""]
[null,null,null,null,null,null,null,"",null,null,""]
[null,null,null,null,null,null,null,"",null,null,""]
[null,null,null,null,null,null,null,"",null,null,""]
[null,null,null,null,null,null,null,"",null,null,""]
[null,null,null,null,null,null,null,"",null,null,""]
[null,null,null,null,null,null,null,"",null,null,""]
[null,null,null,null,null,null,null,"",null,null,""]
[null,null,null,null,null,null,null,"",null,null,""]
[null,null,null,null,null,null,null,"",null,null,""]
[null,null,null,null,null,null,null,"",null,null,""]
[null,null,null,null,null,null,null,"",null,null,""]
[null,null,null,null,null,null,null,"",null,null,""]
[null,null,null,null,null,null,null,"",null,null,""]
[null,null,null,null,null,null,null,"",null,null,""]
[null,null,null,null,null,null,null,"",null,null,""]
[null,null,null,null,null,null,null,"",null,null,""]
[null,null,null,null,null,null,null,"",null,null,""]
[null,null,null,null,null,null,null,"",null,null,""]
[null,null,null,null,null,null,null,"",null,null,""]
[null,null,null,null,null,null,null,"",null,null,""]
[null,null,null,null,null,null,null,"",null,null,""]
[null,null,null,null,null,null,null,"",null,null,""]
[null,null,null,null,null,null,null,"",null,null,""]
[null,null,null,null,null,null,null,"",null,null,""]
[null,null,null,null,null,null,null,"",null,null,""]
[null,null,null,null,null,null,null,"",null,null,""]
[null,null,null,null,null,null,null,"",null,null,""]
[null,null,null,null,null,null,null,"",null,null,""]
[null,null,null,null,null,null,null,"",null,null,""]
[null,null,null,null,null,null,null,"",null,null,""]
[null,null,null,null,null,null,null,"",null,null,""]
[null,null,null,null,null,null,null,{"$f":"IF(A477<>\"\",IF(INDIRECT(ADDRESS(ROW()-1,8))=\"\",ROUND(SUM(INDIRECT(ADDRESS(ROW()-2,8)),F477,-G477),2),ROUND(SUM(INDIRECT(ADDRESS(ROW()-1,8)),F477,-G477),2)),\"\")","v":""},null,null,{"$f":"IF(A477<>\"\",IF(INDIRECT(ADDRESS(ROW()-1,11))=\"\",ROUND(SUM(INDIRECT(ADDRESS(ROW()-2,11)),I477,-J477),2),ROUND(SUM(INDIRECT(ADDRESS(ROW()-1,11)),I477,-J477),2)),\"\")","v":""}]
[null,null,null,null,null,null,null,"",null,null,""]
[null,null,null,null,null,null,null,"",null,null,""]
[null,null,null,null,null,null,null,"",null,null,""]
[null,null,null,null,null,null,null,"",null,null,""]
[null,null,null,null,null,null,null,"",null,null,""]
[null,null,null,null,null,null,null,"",null,null,""]
[null,null,null,null,null,null,null,"",null,null,""]
[null,null,null,null,null,null,null,"",null,null,""]
[null,null,null,null,null,null,null,"",null,null,""]
[null,null,null,null,null,null,null,"",null,null,""]
[null,null,null,null,null,null,null,"",null,null,""]
[null,null,null,null,null,null,null,"",null,null,""]
[null,null,null,null,null,null,null,"",null,null,""]
[null,null,null,null,null,null,null,"",null,null,""]
[null,null,null,null,null,null,null,"",null,null,""]
[null,null,null,null,null,null,null,"",null,null,""]
[null,null,null,null,null,null,null,"",null,null,""]
[null,null,null,null,null,null,null,"",null,null,""]
[null,null,null,null,null,null,null,"",null,null,""]
[null,null,null,null,null,null,null,"",null,null,""]
[null,null,null,null,null,null,null,"",null,null,""]
[null,null,null,null,null,null,null,"",null,null,""]
[null,null,null,null,null,null,null,"",null,null,""]
[null,null,null,null,null,null,null,"",null,null,""]
[null,null,null,null,null,null,null,"",null,null,""]
[null,null,null,null,null,null,null,"",null,null,""]
[null,null,null,null,null,null,null,"",null,null,""]
[null,null,null,null,null,null,null,"",null,null,""]
[null,null,null,null,null,null,null,"",null,null,""]
[null,null,null,null,null,null,null,"",null,null,""]
[null,null,null,null,null,null,null,"",null,null,""]
[null,null,null,null,null,null,null,"",null,null,""]
[null,null,null,null,null,null,null,"",null,null,""]
[null,null,null,null,null,null,null,"",null,null,""]
[null,null,null,null,null,null,null,"",null,null,""]
[null,null,null,null,null,null,null,"",null,null,""]
[null,null,null,null,null,null,null,"",null,null,""]
[null,null,null,null,null,null,null,"",null,null,""]
[null,null,null,null,null,null,null,"",null,null,""]
[null,null,null,null,null,null,null,"",null,null,""]
[null,null,null,null,null,null,null,"",null,null,""]
[null,null,null,null,null,null,null,"",null,null,""]
[null,null,null,null,null,null,null,"",null,null,""]
[null,null,null,null,null,null,null,"",null,null,""]
[null,null,null,null,null,null,null,"",null,null,""]
[null,null,null,null,null,null,null,"",null,null,""]
[null,null,null,null,null,null,null,"",null,null,""]
[null,null,null,null,null,null,null,"",null,null,""]
[null,null,null,null,null,null,null,"",null,null,""]
[null,null,null,null,null,null,null,"",null,null,""]
[null,null,null,null,null,null,null,"",null,null,""]
[null,null,null,null,null,null,null,"",null,null,""]
[null,null,null,null,null,null,null,null,null,null,{"$f":"IF(A530<>\"\",IF(INDIRECT(ADDRESS(ROW()-1,11))=\"\",ROUND(SUM(INDIRECT(ADDRESS(ROW()-2,11)),I530,-J530),2),ROUND(SUM(INDIRECT(ADDRESS(ROW()-1,11)),I530,-J530),2)),\"\")","v":""}]
[null,null,null,null,null,null,null,null,null,null,""]

{"sheet":"cTABUI","index":16,"n_rows":110,"n_cols":18,"rows_kept":110,"cut":false,"hidden":true,"merged":[[8,15,9,15],[8,16,9,16],[8,17,9,17],[8,0,9,0],[8,1,9,1],[8,2,9,2],[8,3,9,3],[8,4,9,4]]}
[null,"Questo prospetto è interamente generato dalla procedura e non deve essere mai variato direttamente e manualmente dall'utilizzatore. "]
[]
[]
[]
[null,{"$f":"NomeCondominio()","v":"Condominio Palazzo Duck"}]
[]
[]
[null,"TABELLE MILLESIMALI per UNITÀ IMMOBILIARI"]
[null,"Codice\nUnità\nImmobiliare","U.F.\nCostituenti","Codice\nCondomino\nProprietario","Denominazione\nCondomino","Tabella A","Tabella B","Tabella C","Tabella D","Tabella E","Tabella F","Tabella G","Tabella H","Tabella I","Tabella J","Part","Sub","Categ."]
[null,null,null,null,null,{"$f":"iDG!$B52","v":"Proprietà"},{"$f":"iDG!$B53","v":"Scala"},{"$f":"iDG!$B54","v":"Ascensore"},{"$f":"iDG!$B55","v":"Abitazioni"},{"$f":"iDG!$B56","v":"Negozi"},{"$f":"iDG!$B57","v":0},{"$f":"iDG!$B58","v":0},{"$f":"iDG!$B59","v":0},{"$f":"iDG!$B60","v":0},{"$f":"iDG!$B61","v":0}]
[null,"U01","UF11",{"$f":"IF(iUI!D11<>\"\",iUI!D11,\"\")","v":"C01"},{"$f":"IF(iUI!F11<>\"\",iUI!F11,\"\")","v":"Paperoga"},{"$f":"SUMIFS(iTABUF!$D$11:$D$109,iTABUF!$C$11:$C$109,B11)","v":52.392000000000003},{"$f":"SUMIFS(iTABUF!$E$11:$E$109,iTABUF!$C$11:$C$109,B11)","v":0},{"$f":"SUMIFS(iTABUF!$F$11:$F$109,iTABUF!$C$11:$C$109,B11)","v":0},{"$f":"SUMIFS(iTABUF!$G$11:$G$109,iTABUF!$C$11:$C$109,B11)","v":0},{"$f":"SUMIFS(iTABUF!$H$11:$H$109,iTABUF!$C$11:$C$109,B11)","v":161.221},{"$f":"SUMIFS(iTABUF!$I$11:$I$109,iTABUF!$C$11:$C$109,B11)","v":0},{"$f":"SUMIFS(iTABUF!$J$11:$J$109,iTABUF!$C$11:$C$109,B11)","v":0},{"$f":"SUMIFS(iTABUF!$K$11:$K$109,iTABUF!$C$11:$C$109,B11)","v":0},{"$f":"SUMIFS(iTABUF!$L$11:$L$109,iTABUF!$C$11:$C$109,B11)","v":0},{"$f":"SUMIFS(iTABUF!$M$11:$M$109,iTABUF!$C$11:$C$109,B11)","v":0},{"$f":"iUI!I11","v":121},{"$f":"iUI!J11","v":2},{"$f":"iUI!L11","v":"C/1"}]
[null,"U02","UF12",{"$f":"IF(iUI!D12<>\"\",iUI!D12,\"\")","v":"C02"},{"$f":"IF(iUI!F12<>\"\",iUI!F12,\"\")","v":"Ciccio"},{"$f":"SUMIFS(iTABUF!$D$11:$D$109,iTABUF!$C$11:$C$109,B12)","v":35.476999999999997},{"$f":"SUMIFS(iTABUF!$E$11:$E$109,iTABUF!$C$11:$C$109,B12)","v":0},{"$f":"SUMIFS(iTABUF!$F$11:$F$109,iTABUF!$C$11:$C$109,B12)","v":0},{"$f":"SUMIFS(iTABUF!$G$11:$G$109,iTABUF!$C$11:$C$109,B12)","v":0},{"$f":"SUMIFS(iTABUF!$H$11:$H$109,iTABUF!$C$11:$C$109,B12)","v":109.17},{"$f":"SUMIFS(iTABUF!$I$11:$I$109,iTABUF!$C$11:$C$109,B12)","v":0},{"$f":"SUMIFS(iTABUF!$J$11:$J$109,iTABUF!$C$11:$C$109,B12)","v":0},{"$f":"SUMIFS(iTABUF!$K$11:$K$109,iTABUF!$C$11:$C$109,B12)","v":0},{"$f":"SUMIFS(iTABUF!$L$11:$L$109,iTABUF!$C$11:$C$109,B12)","v":0},{"$f":"SUMIFS(iTABUF!$M$11:$M$109,iTABUF!$C$11:$C$109,B12)","v":0},{"$f":"iUI!I12","v":121},{"$f":"iUI!J12","v":3},{"$f":"iUI!L12","v":"C/1"}]
[null,"U03","UF13",{"$f":"IF(iUI!D13<>\"\",iUI!D13,\"\")","v":"C03"},{"$f":"IF(iUI!F13<>\"\",iUI!F13,\"\")","v":"Gastone"},{"$f":"SUMIFS(iTABUF!$D$11:$D$109,iTABUF!$C$11:$C$109,B13)","v":100.43899999999999},{"$f":"SUMIFS(iTABUF!$E$11:$E$109,iTABUF!$C$11:$C$109,B13)","v":0},{"$f":"SUMIFS(iTABUF!$F$11:$F$109,iTABUF!$C$11:$C$109,B13)","v":0},{"$f":"SUMIFS(iTABUF!$G$11:$G$109,iTABUF!$C$11:$C$109,B13)","v":0},{"$f":"SUMIFS(iTABUF!$H$11:$H$109,iTABUF!$C$11:$C$109,B13)","v":309.06900000000002},{"$f":"SUMIFS(iTABUF!$I$11:$I$109,iTABUF!$C$11:$C$109,B13)","v":0},{"$f":"SUMIFS(iTABUF!$J$11:$J$109,iTABUF!$C$11:$C$109,B13)","v":0},{"$f":"SUMIFS(iTABUF!$K$11:$K$109,iTABUF!$C$11:$C$109,B13)","v":0},{"$f":"SUMIFS(iTABUF!$L$11:$L$109,iTABUF!$C$11:$C$109,B13)","v":0},{"$f":"SUMIFS(iTABUF!$M$11:$M$109,iTABUF!$C$11:$C$109,B13)","v":0},{"$f":"iUI!I13","v":121},{"$f":"iUI!J13","v":4},{"$f":"iUI!L13","v":"C/1"}]
[null,"U04","UF14",{"$f":"IF(iUI!D14<>\"\",iUI!D14,\"\")","v":"C04"},{"$f":"IF(iUI!F14<>\"\",iUI!F14,\"\")","v":"I tre nipotini"},{"$f":"SUMIFS(iTABUF!$D$11:$D$109,iTABUF!$C$11:$C$109,B14)","v":136.66399999999999},{"$f":"SUMIFS(iTABUF!$E$11:$E$109,iTABUF!$C$11:$C$109,B14)","v":0},{"$f":"SUMIFS(iTABUF!$F$11:$F$109,iTABUF!$C$11:$C$109,B14)","v":0},{"$f":"SUMIFS(iTABUF!$G$11:$G$109,iTABUF!$C$11:$C$109,B14)","v":0},{"$f":"SUMIFS(iTABUF!$H$11:$H$109,iTABUF!$C$11:$C$109,B14)","v":420.54},{"$f":"SUMIFS(iTABUF!$I$11:$I$109,iTABUF!$C$11:$C$109,B14)","v":0},{"$f":"SUMIFS(iTABUF!$J$11:$J$109,iTABUF!$C$11:$C$109,B14)","v":0},{"$f":"SUMIFS(iTABUF!$K$11:$K$109,iTABUF!$C$11:$C$109,B14)","v":0},{"$f":"SUMIFS(iTABUF!$L$11:$L$109,iTABUF!$C$11:$C$109,B14)","v":0},{"$f":"SUMIFS(iTABUF!$M$11:$M$109,iTABUF!$C$11:$C$109,B14)","v":0},{"$f":"iUI!I14","v":121},{"$f":"iUI!J14","v":5},{"$f":"iUI!L14","v":"C/1"}]
[null,"U05","UF01+UF07+UF16+UF17",{"$f":"IF(iUI!D15<>\"\",iUI!D15,\"\")","v":"C05"},{"$f":"IF(iUI!F15<>\"\",iUI!F15,\"\")","v":"Nonna Papera"},{"$f":"SUMIFS(iTABUF!$D$11:$D$109,iTABUF!$C$11:$C$109,B15)","v":183.96899999999999},{"$f":"SUMIFS(iTABUF!$E$11:$E$109,iTABUF!$C$11:$C$109,B15)","v":230.61},{"$f":"SUMIFS(iTABUF!$F$11:$F$109,iTABUF!$C$11:$C$109,B15)","v":230.61},{"$f":"SUMIFS(iTABUF!$G$11:$G$109,iTABUF!$C$11:$C$109,B15)","v":272.53699999999998},{"$f":"SUMIFS(iTABUF!$H$11:$H$109,iTABUF!$C$11:$C$109,B15)","v":0},{"$f":"SUMIFS(iTABUF!$I$11:$I$109,iTABUF!$C$11:$C$109,B15)","v":0},{"$f":"SUMIFS(iTABUF!$J$11:$J$109,iTABUF!$C$11:$C$109,B15)","v":0},{"$f":"SUMIFS(iTABUF!$K$11:$K$109,iTABUF!$C$11:$C$109,B15)","v":0},{"$f":"SUMIFS(iTABUF!$L$11:$L$109,iTABUF!$C$11:$C$109,B15)","v":0},{"$f":"SUMIFS(iTABUF!$M$11:$M$109,iTABUF!$C$11:$C$109,B15)","v":0},{"$f":"iUI!I15","v":121},{"$f":"iUI!J15","v":6},{"$f":"iUI!L15","v":"A/2"}]
[null,"U06","UF02+UF08+UF18",{"$f":"IF(iUI!D16<>\"\",iUI!D16,\"\")","v":"C05"},{"$f":"IF(iUI!F16<>\"\",iUI!F16,\"\")","v":"Nonna Papera"},{"$f":"SUMIFS(iTABUF!$D$11:$D$109,iTABUF!$C$11:$C$109,B16)","v":121.7},{"$f":"SUMIFS(iTABUF!$E$11:$E$109,iTABUF!$C$11:$C$109,B16)","v":153.745},{"$f":"SUMIFS(iTABUF!$F$11:$F$109,iTABUF!$C$11:$C$109,B16)","v":153.745},{"$f":"SUMIFS(iTABUF!$G$11:$G$109,iTABUF!$C$11:$C$109,B16)","v":180.28900000000002},{"$f":"SUMIFS(iTABUF!$H$11:$H$109,iTABUF!$C$11:$C$109,B16)","v":0},{"$f":"SUMIFS(iTABUF!$I$11:$I$109,iTABUF!$C$11:$C$109,B16)","v":0},{"$f":"SUMIFS(iTABUF!$J$11:$J$109,iTABUF!$C$11:$C$109,B16)","v":0},{"$f":"SUMIFS(iTABUF!$K$11:$K$109,iTABUF!$C$11:$C$109,B16)","v":0},{"$f":"SUMIFS(iTABUF!$L$11:$L$109,iTABUF!$C$11:$C$109,B16)","v":0},{"$f":"SUMIFS(iTABUF!$M$11:$M$109,iTABUF!$C$11:$C$109,B16)","v":0},{"$f":"iUI!I16","v":121},{"$f":"iUI!J16","v":7},{"$f":"iUI!L16","v":"A/2"}]
[null,"U07","UF03+UF04+UF05+UF06+UF15+\nUF19+UF20+UF21",{"$f":"IF(iUI!D17<>\"\",iUI!D17,\"\")","v":"C06"},{"$f":"IF(iUI!F17<>\"\",iUI!F17,\"\")","v":"Fidanzati Paperino-Paperina"},{"$f":"SUMIFS(iTABUF!$D$11:$D$109,iTABUF!$C$11:$C$109,B17)","v":334.03700000000003},{"$f":"SUMIFS(iTABUF!$E$11:$E$109,iTABUF!$C$11:$C$109,B17)","v":527.07900000000018},{"$f":"SUMIFS(iTABUF!$F$11:$F$109,iTABUF!$C$11:$C$109,B17)","v":527.07900000000018},{"$f":"SUMIFS(iTABUF!$G$11:$G$109,iTABUF!$C$11:$C$109,B17)","v":494.84900000000005},{"$f":"SUMIFS(iTABUF!$H$11:$H$109,iTABUF!$C$11:$C$109,B17)","v":0},{"$f":"SUMIFS(iTABUF!$I$11:$I$109,iTABUF!$C$11:$C$109,B17)","v":0},{"$f":"SUMIFS(iTABUF!$J$11:$J$109,iTABUF!$C$11:$C$109,B17)","v":0},{"$f":"SUMIFS(iTABUF!$K$11:$K$109,iTABUF!$C$11:$C$109,B17)","v":0},{"$f":"SUMIFS(iTABUF!$L$11:$L$109,iTABUF!$C$11:$C$109,B17)","v":0},{"$f":"SUMIFS(iTABUF!$M$11:$M$109,iTABUF!$C$11:$C$109,B17)","v":0},{"$f":"iUI!I17","v":121},{"$f":"iUI!J17","v":8},{"$f":"iUI!L17","v":"A/2"}]
[null,"U08","UF09",{"$f":"IF(iUI!D18<>\"\",iUI!D18,\"\")","v":"C06"},{"$f":"IF(iUI!F18<>\"\",iUI!F18,\"\")","v":"Fidanzati Paperino-Paperina"},{"$f":"SUMIFS(iTABUF!$D$11:$D$109,iTABUF!$C$11:$C$109,B18)","v":13.183999999999999},{"$f":"SUMIFS(iTABUF!$E$11:$E$109,iTABUF!$C$11:$C$109,B18)","v":33.057000000000002},{"$f":"SUMIFS(iTABUF!$F$11:$F$109,iTABUF!$C$11:$C$109,B18)","v":33.057000000000002},{"$f":"SUMIFS(iTABUF!$G$11:$G$109,iTABUF!$C$11:$C$109,B18)","v":19.53},{"$f":"SUMIFS(iTABUF!$H$11:$H$109,iTABUF!$C$11:$C$109,B18)","v":0},{"$f":"SUMIFS(iTABUF!$I$11:$I$109,iTABUF!$C$11:$C$109,B18)","v":0},{"$f":"SUMIFS(iTABUF!$J$11:$J$109,iTABUF!$C$11:$C$109,B18)","v":0},{"$f":"SUMIFS(iTABUF!$K$11:$K$109,iTABUF!$C$11:$C$109,B18)","v":0},{"$f":"SUMIFS(iTABUF!$L$11:$L$109,iTABUF!$C$11:$C$109,B18)","v":0},{"$f":"SUMIFS(iTABUF!$M$11:$M$109,iTABUF!$C$11:$C$109,B18)","v":0},{"$f":"iUI!I18","v":121},{"$f":"iUI!J18","v":9},{"$f":"iUI!L18","v":"C/6"}]
[null,"U09","UF10",{"$f":"IF(iUI!D19<>\"\",iUI!D19,\"\")","v":"C05"},{"$f":"IF(iUI!F19<>\"\",iUI!F19,\"\")","v":"Nonna Papera"},{"$f":"SUMIFS(iTABUF!$D$11:$D$109,iTABUF!$C$11:$C$109,B19)","v":22.138000000000002},{"$f":"SUMIFS(iTABUF!$E$11:$E$109,iTABUF!$C$11:$C$109,B19)","v":55.509},{"$f":"SUMIFS(iTABUF!$F$11:$F$109,iTABUF!$C$11:$C$109,B19)","v":55.509},{"$f":"SUMIFS(iTABUF!$G$11:$G$109,iTABUF!$C$11:$C$109,B19)","v":32.795000000000002},{"$f":"SUMIFS(iTABUF!$H$11:$H$109,iTABUF!$C$11:$C$109,B19)","v":0},{"$f":"SUMIFS(iTABUF!$I$11:$I$109,iTABUF!$C$11:$C$109,B19)","v":0},{"$f":"SUMIFS(iTABUF!$J$11:$J$109,iTABUF!$C$11:$C$109,B19)","v":0},{"$f":"SUMIFS(iTABUF!$K$11:$K$109,iTABUF!$C$11:$C$109,B19)","v":0},{"$f":"SUMIFS(iTABUF!$L$11:$L$109,iTABUF!$C$11:$C$109,B19)","v":0},{"$f":"SUMIFS(iTABUF!$M$11:$M$109,iTABUF!$C$11:$C$109,B19)","v":0},{"$f":"iUI!I19","v":121},{"$f":"iUI!J19","v":10},{"$f":"iUI!L19","v":"C/6"}]
[null,"U10",null,{"$f":"IF(iUI!D20<>\"\",iUI!D20,\"\")","v":""},{"$f":"IF(iUI!F20<>\"\",iUI!F20,\"\")","v":""},{"$f":"SUMIFS(iTABUF!$D$11:$D$109,iTABUF!$C$11:$C$109,B20)","v":0},{"$f":"SUMIFS(iTABUF!$E$11:$E$109,iTABUF!$C$11:$C$109,B20)","v":0},{"$f":"SUMIFS(iTABUF!$F$11:$F$109,iTABUF!$C$11:$C$109,B20)","v":0},{"$f":"SUMIFS(iTABUF!$G$11:$G$109,iTABUF!$C$11:$C$109,B20)","v":0},{"$f":"SUMIFS(iTABUF!$H$11:$H$109,iTABUF!$C$11:$C$109,B20)","v":0},{"$f":"SUMIFS(iTABUF!$I$11:$I$109,iTABUF!$C$11:$C$109,B20)","v":0},{"$f":"SUMIFS(iTABUF!$J$11:$J$109,iTABUF!$C$11:$C$109,B20)","v":0},{"$f":"SUMIFS(iTABUF!$K$11:$K$109,iTABUF!$C$11:$C$109,B20)","v":0},{"$f":"SUMIFS(iTABUF!$L$11:$L$109,iTABUF!$C$11:$C$109,B20)","v":0},{"$f":"SUMIFS(iTABUF!$M$11:$M$109,iTABUF!$C$11:$C$109,B20)","v":0},{"$f":"iUI!I20","v":0},{"$f":"iUI!J20","v":0},{"$f":"iUI!L20","v":0}]
[null,"U11",null,{"$f":"IF(iUI!D21<>\"\",iUI!D21,\"\")","v":""},{"$f":"IF(iUI!F21<>\"\",iUI!F21,\"\")","v":""},{"$f":"SUMIFS(iTABUF!$D$11:$D$109,iTABUF!$C$11:$C$109,B21)","v":0},{"$f":"SUMIFS(iTABUF!$E$11:$E$109,iTABUF!$C$11:$C$109,B21)","v":0},{"$f":"SUMIFS(iTABUF!$F$11:$F$109,iTABUF!$C$11:$C$109,B21)","v":0},{"$f":"SUMIFS(iTABUF!$G$11:$G$109,iTABUF!$C$11:$C$109,B21)","v":0},{"$f":"SUMIFS(iTABUF!$H$11:$H$109,iTABUF!$C$11:$C$109,B21)","v":0},{"$f":"SUMIFS(iTABUF!$I$11:$I$109,iTABUF!$C$11:$C$109,B21)","v":0},{"$f":"SUMIFS(iTABUF!$J$11:$J$109,iTABUF!$C$11:$C$109,B21)","v":0},{"$f":"SUMIFS(iTABUF!$K$11:$K$109,iTABUF!$C$11:$C$109,B21)","v":0},{"$f":"SUMIFS(iTABUF!$L$11:$L$109,iTABUF!$C$11:$C$109,B21)","v":0},{"$f":"SUMIFS(iTABUF!$M$11:$M$109,iTABUF!$C$11:$C$109,B21)","v":0},{"$f":"iUI!I21","v":0},{"$f":"iUI!J21","v":0},{"$f":"iUI!L21","v":0}]
[null,"U12",null,{"$f":"IF(iUI!D22<>\"\",iUI!D22,\"\")","v":""},{"$f":"IF(iUI!F22<>\"\",iUI!F22,\"\")","v":""},{"$f":"SUMIFS(iTABUF!$D$11:$D$109,iTABUF!$C$11:$C$109,B22)","v":0},{"$f":"SUMIFS(iTABUF!$E$11:$E$109,iTABUF!$C$11:$C$109,B22)","v":0},{"$f":"SUMIFS(iTABUF!$F$11:$F$109,iTABUF!$C$11:$C$109,B22)","v":0},{"$f":"SUMIFS(iTABUF!$G$11:$G$109,iTABUF!$C$11:$C$109,B22)","v":0},{"$f":"SUMIFS(iTABUF!$H$11:$H$109,iTABUF!$C$11:$C$109,B22)","v":0},{"$f":"SUMIFS(iTABUF!$I$11:$I$109,iTABUF!$C$11:$C$109,B22)","v":0},{"$f":"SUMIFS(iTABUF!$J$11:$J$109,iTABUF!$C$11:$C$109,B22)","v":0},{"$f":"SUMIFS(iTABUF!$K$11:$K$109,iTABUF!$C$11:$C$109,B22)","v":0},{"$f":"SUMIFS(iTABUF!$L$11:$L$109,iTABUF!$C$11:$C$109,B22)","v":0},{"$f":"SUMIFS(iTABUF!$M$11:$M$109,iTABUF!$C$11:$C$109,B22)","v":0},{"$f":"iUI!I22","v":0},{"$f":"iUI!J22","v":0},{"$f":"iUI!L22","v":0}]
[null,"U13",null,{"$f":"IF(iUI!D23<>\"\",iUI!D23,\"\")","v":""},{"$f":"IF(iUI!F23<>\"\",iUI!F23,\"\")","v":""},{"$f":"SUMIFS(iTABUF!$D$11:$D$109,iTABUF!$C$11:$C$109,B23)","v":0},{"$f":"SUMIFS(iTABUF!$E$11:$E$109,iTABUF!$C$11:$C$109,B23)","v":0},{"$f":"SUMIFS(iTABUF!$F$11:$F$109,iTABUF!$C$11:$C$109,B23)","v":0},{"$f":"SUMIFS(iTABUF!$G$11:$G$109,iTABUF!$C$11:$C$109,B23)","v":0},{"$f":"SUMIFS(iTABUF!$H$11:$H$109,iTABUF!$C$11:$C$109,B23)","v":0},{"$f":"SUMIFS(iTABUF!$I$11:$I$109,iTABUF!$C$11:$C$109,B23)","v":0},{"$f":"SUMIFS(iTABUF!$J$11:$J$109,iTABUF!$C$11:$C$109,B23)","v":0},{"$f":"SUMIFS(iTABUF!$K$11:$K$109,iTABUF!$C$11:$C$109,B23)","v":0},{"$f":"SUMIFS(iTABUF!$L$11:$L$109,iTABUF!$C$11:$C$109,B23)","v":0},{"$f":"SUMIFS(iTABUF!$M$11:$M$109,iTABUF!$C$11:$C$109,B23)","v":0},{"$f":"iUI!I23","v":0},{"$f":"iUI!J23","v":0},{"$f":"iUI!L23","v":0}]
[null,"U14",null,{"$f":"IF(iUI!D24<>\"\",iUI!D24,\"\")","v":""},{"$f":"IF(iUI!F24<>\"\",iUI!F24,\"\")","v":""},{"$f":"SUMIFS(iTABUF!$D$11:$D$109,iTABUF!$C$11:$C$109,B24)","v":0},{"$f":"SUMIFS(iTABUF!$E$11:$E$109,iTABUF!$C$11:$C$109,B24)","v":0},{"$f":"SUMIFS(iTABUF!$F$11:$F$109,iTABUF!$C$11:$C$109,B24)","v":0},{"$f":"SUMIFS(iTABUF!$G$11:$G$109,iTABUF!$C$11:$C$109,B24)","v":0},{"$f":"SUMIFS(iTABUF!$H$11:$H$109,iTABUF!$C$11:$C$109,B24)","v":0},{"$f":"SUMIFS(iTABUF!$I$11:$I$109,iTABUF!$C$11:$C$109,B24)","v":0},{"$f":"SUMIFS(iTABUF!$J$11:$J$109,iTABUF!$C$11:$C$109,B24)","v":0},{"$f":"SUMIFS(iTABUF!$K$11:$K$109,iTABUF!$C$11:$C$109,B24)","v":0},{"$f":"SUMIFS(iTABUF!$L$11:$L$109,iTABUF!$C$11:$C$109,B24)","v":0},{"$f":"SUMIFS(iTABUF!$M$11:$M$109,iTABUF!$C$11:$C$109,B24)","v":0},{"$f":"iUI!I24","v":0},{"$f":"iUI!J24","v":0},{"$f":"iUI!L24","v":0}]
[null,"U15",null,{"$f":"IF(iUI!D25<>\"\",iUI!D25,\"\")","v":""},{"$f":"IF(iUI!F25<>\"\",iUI!F25,\"\")","v":""},{"$f":"SUMIFS(iTABUF!$D$11:$D$109,iTABUF!$C$11:$C$109,B25)","v":0},{"$f":"SUMIFS(iTABUF!$E$11:$E$109,iTABUF!$C$11:$C$109,B25)","v":0},{"$f":"SUMIFS(iTABUF!$F$11:$F$109,iTABUF!$C$11:$C$109,B25)","v":0},{"$f":"SUMIFS(iTABUF!$G$11:$G$109,iTABUF!$C$11:$C$109,B25)","v":0},{"$f":"SUMIFS(iTABUF!$H$11:$H$109,iTABUF!$C$11:$C$109,B25)","v":0},{"$f":"SUMIFS(iTABUF!$I$11:$I$109,iTABUF!$C$11:$C$109,B25)","v":0},{"$f":"SUMIFS(iTABUF!$J$11:$J$109,iTABUF!$C$11:$C$109,B25)","v":0},{"$f":"SUMIFS(iTABUF!$K$11:$K$109,iTABUF!$C$11:$C$109,B25)","v":0},{"$f":"SUMIFS(iTABUF!$L$11:$L$109,iTABUF!$C$11:$C$109,B25)","v":0},{"$f":"SUMIFS(iTABUF!$M$11:$M$109,iTABUF!$C$11:$C$109,B25)","v":0},{"$f":"iUI!I25","v":0},{"$f":"iUI!J25","v":0},{"$f":"iUI!L25","v":0}]
[null,"U16",null,{"$f":"IF(iUI!D26<>\"\",iUI!D26,\"\")","v":""},{"$f":"IF(iUI!F26<>\"\",iUI!F26,\"\")","v":""},{"$f":"SUMIFS(iTABUF!$D$11:$D$109,iTABUF!$C$11:$C$109,B26)","v":0},{"$f":"SUMIFS(iTABUF!$E$11:$E$109,iTABUF!$C$11:$C$109,B26)","v":0},{"$f":"SUMIFS(iTABUF!$F$11:$F$109,iTABUF!$C$11:$C$109,B26)","v":0},{"$f":"SUMIFS(iTABUF!$G$11:$G$109,iTABUF!$C$11:$C$109,B26)","v":0},{"$f":"SUMIFS(iTABUF!$H$11:$H$109,iTABUF!$C$11:$C$109,B26)","v":0},{"$f":"SUMIFS(iTABUF!$I$11:$I$109,iTABUF!$C$11:$C$109,B26)","v":0},{"$f":"SUMIFS(iTABUF!$J$11:$J$109,iTABUF!$C$11:$C$109,B26)","v":0},{"$f":"SUMIFS(iTABUF!$K$11:$K$109,iTABUF!$C$11:$C$109,B26)","v":0},{"$f":"SUMIFS(iTABUF!$L$11:$L$109,iTABUF!$C$11:$C$109,B26)","v":0},{"$f":"SUMIFS(iTABUF!$M$11:$M$109,iTABUF!$C$11:$C$109,B26)","v":0},{"$f":"iUI!I26","v":0},{"$f":"iUI!J26","v":0},{"$f":"iUI!L26","v":0}]
[null,"U17",null,{"$f":"IF(iUI!D27<>\"\",iUI!D27,\"\")","v":""},{"$f":"IF(iUI!F27<>\"\",iUI!F27,\"\")","v":""},{"$f":"SUMIFS(iTABUF!$D$11:$D$109,iTABUF!$C$11:$C$109,B27)","v":0},{"$f":"SUMIFS(iTABUF!$E$11:$E$109,iTABUF!$C$11:$C$109,B27)","v":0},{"$f":"SUMIFS(iTABUF!$F$11:$F$109,iTABUF!$C$11:$C$109,B27)","v":0},{"$f":"SUMIFS(iTABUF!$G$11:$G$109,iTABUF!$C$11:$C$109,B27)","v":0},{"$f":"SUMIFS(iTABUF!$H$11:$H$109,iTABUF!$C$11:$C$109,B27)","v":0},{"$f":"SUMIFS(iTABUF!$I$11:$I$109,iTABUF!$C$11:$C$109,B27)","v":0},{"$f":"SUMIFS(iTABUF!$J$11:$J$109,iTABUF!$C$11:$C$109,B27)","v":0},{"$f":"SUMIFS(iTABUF!$K$11:$K$109,iTABUF!$C$11:$C$109,B27)","v":0},{"$f":"SUMIFS(iTABUF!$L$11:$L$109,iTABUF!$C$11:$C$109,B27)","v":0},{"$f":"SUMIFS(iTABUF!$M$11:$M$109,iTABUF!$C$11:$C$109,B27)","v":0},{"$f":"iUI!I27","v":0},{"$f":"iUI!J27","v":0},{"$f":"iUI!L27","v":0}]
[null,"U18",null,{"$f":"IF(iUI!D28<>\"\",iUI!D28,\"\")","v":""},{"$f":"IF(iUI!F28<>\"\",iUI!F28,\"\")","v":""},{"$f":"SUMIFS(iTABUF!$D$11:$D$109,iTABUF!$C$11:$C$109,B28)","v":0},{"$f":"SUMIFS(iTABUF!$E$11:$E$109,iTABUF!$C$11:$C$109,B28)","v":0},{"$f":"SUMIFS(iTABUF!$F$11:$F$109,iTABUF!$C$11:$C$109,B28)","v":0},{"$f":"SUMIFS(iTABUF!$G$11:$G$109,iTABUF!$C$11:$C$109,B28)","v":0},{"$f":"SUMIFS(iTABUF!$H$11:$H$109,iTABUF!$C$11:$C$109,B28)","v":0},{"$f":"SUMIFS(iTABUF!$I$11:$I$109,iTABUF!$C$11:$C$109,B28)","v":0},{"$f":"SUMIFS(iTABUF!$J$11:$J$109,iTABUF!$C$11:$C$109,B28)","v":0},{"$f":"SUMIFS(iTABUF!$K$11:$K$109,iTABUF!$C$11:$C$109,B28)","v":0},{"$f":"SUMIFS(iTABUF!$L$11:$L$109,iTABUF!$C$11:$C$109,B28)","v":0},{"$f":"SUMIFS(iTABUF!$M$11:$M$109,iTABUF!$C$11:$C$109,B28)","v":0},{"$f":"iUI!I28","v":0},{"$f":"iUI!J28","v":0},{"$f":"iUI!L28","v":0}]
[null,"U19",null,{"$f":"IF(iUI!D29<>\"\",iUI!D29,\"\")","v":""},{"$f":"IF(iUI!F29<>\"\",iUI!F29,\"\")","v":""},{"$f":"SUMIFS(iTABUF!$D$11:$D$109,iTABUF!$C$11:$C$109,B29)","v":0},{"$f":"SUMIFS(iTABUF!$E$11:$E$109,iTABUF!$C$11:$C$109,B29)","v":0},{"$f":"SUMIFS(iTABUF!$F$11:$F$109,iTABUF!$C$11:$C$109,B29)","v":0},{"$f":"SUMIFS(iTABUF!$G$11:$G$109,iTABUF!$C$11:$C$109,B29)","v":0},{"$f":"SUMIFS(iTABUF!$H$11:$H$109,iTABUF!$C$11:$C$109,B29)","v":0},{"$f":"SUMIFS(iTABUF!$I$11:$I$109,iTABUF!$C$11:$C$109,B29)","v":0},{"$f":"SUMIFS(iTABUF!$J$11:$J$109,iTABUF!$C$11:$C$109,B29)","v":0},{"$f":"SUMIFS(iTABUF!$K$11:$K$109,iTABUF!$C$11:$C$109,B29)","v":0},{"$f":"SUMIFS(iTABUF!$L$11:$L$109,iTABUF!$C$11:$C$109,B29)","v":0},{"$f":"SUMIFS(iTABUF!$M$11:$M$109,iTABUF!$C$11:$C$109,B29)","v":0},{"$f":"iUI!I29","v":0},{"$f":"iUI!J29","v":0},{"$f":"iUI!L29","v":0}]
[null,"U20",null,{"$f":"IF(iUI!D30<>\"\",iUI!D30,\"\")","v":""},{"$f":"IF(iUI!F30<>\"\",iUI!F30,\"\")","v":""},{"$f":"SUMIFS(iTABUF!$D$11:$D$109,iTABUF!$C$11:$C$109,B30)","v":0},{"$f":"SUMIFS(iTABUF!$E$11:$E$109,iTABUF!$C$11:$C$109,B30)","v":0},{"$f":"SUMIFS(iTABUF!$F$11:$F$109,iTABUF!$C$11:$C$109,B30)","v":0},{"$f":"SUMIFS(iTABUF!$G$11:$G$109,iTABUF!$C$11:$C$109,B30)","v":0},{"$f":"SUMIFS(iTABUF!$H$11:$H$109,iTABUF!$C$11:$C$109,B30)","v":0},{"$f":"SUMIFS(iTABUF!$I$11:$I$109,iTABUF!$C$11:$C$109,B30)","v":0},{"$f":"SUMIFS(iTABUF!$J$11:$J$109,iTABUF!$C$11:$C$109,B30)","v":0},{"$f":"SUMIFS(iTABUF!$K$11:$K$109,iTABUF!$C$11:$C$109,B30)","v":0},{"$f":"SUMIFS(iTABUF!$L$11:$L$109,iTABUF!$C$11:$C$109,B30)","v":0},{"$f":"SUMIFS(iTABUF!$M$11:$M$109,iTABUF!$C$11:$C$109,B30)","v":0},{"$f":"iUI!I30","v":0},{"$f":"iUI!J30","v":0},{"$f":"iUI!L30","v":0}]
[null,"U21",null,{"$f":"IF(iUI!D31<>\"\",iUI!D31,\"\")","v":""},{"$f":"IF(iUI!F31<>\"\",iUI!F31,\"\")","v":""},{"$f":"SUMIFS(iTABUF!$D$11:$D$109,iTABUF!$C$11:$C$109,B31)","v":0},{"$f":"SUMIFS(iTABUF!$E$11:$E$109,iTABUF!$C$11:$C$109,B31)","v":0},{"$f":"SUMIFS(iTABUF!$F$11:$F$109,iTABUF!$C$11:$C$109,B31)","v":0},{"$f":"SUMIFS(iTABUF!$G$11:$G$109,iTABUF!$C$11:$C$109,B31)","v":0},{"$f":"SUMIFS(iTABUF!$H$11:$H$109,iTABUF!$C$11:$C$109,B31)","v":0},{"$f":"SUMIFS(iTABUF!$I$11:$I$109,iTABUF!$C$11:$C$109,B31)","v":0},{"$f":"SUMIFS(iTABUF!$J$11:$J$109,iTABUF!$C$11:$C$109,B31)","v":0},{"$f":"SUMIFS(iTABUF!$K$11:$K$109,iTABUF!$C$11:$C$109,B31)","v":0},{"$f":"SUMIFS(iTABUF!$L$11:$L$109,iTABUF!$C$11:$C$109,B31)","v":0},{"$f":"SUMIFS(iTABUF!$M$11:$M$109,iTABUF!$C$11:$C$109,B31)","v":0},{"$f":"iUI!I31","v":0},{"$f":"iUI!J31","v":0},{"$f":"iUI!L31","v":0}]
[null,"U22",null,{"$f":"IF(iUI!D32<>\"\",iUI!D32,\"\")","v":""},{"$f":"IF(iUI!F32<>\"\",iUI!F32,\"\")","v":""},{"$f":"SUMIFS(iTABUF!$D$11:$D$109,iTABUF!$C$11:$C$109,B32)","v":0},{"$f":"SUMIFS(iTABUF!$E$11:$E$109,iTABUF!$C$11:$C$109,B32)","v":0},{"$f":"SUMIFS(iTABUF!$F$11:$F$109,iTABUF!$C$11:$C$109,B32)","v":0},{"$f":"SUMIFS(iTABUF!$G$11:$G$109,iTABUF!$C$11:$C$109,B32)","v":0},{"$f":"SUMIFS(iTABUF!$H$11:$H$109,iTABUF!$C$11:$C$109,B32)","v":0},{"$f":"SUMIFS(iTABUF!$I$11:$I$109,iTABUF!$C$11:$C$109,B32)","v":0},{"$f":"SUMIFS(iTABUF!$J$11:$J$109,iTABUF!$C$11:$C$109,B32)","v":0},{"$f":"SUMIFS(iTABUF!$K$11:$K$109,iTABUF!$C$11:$C$109,B32)","v":0},{"$f":"SUMIFS(iTABUF!$L$11:$L$109,iTABUF!$C$11:$C$109,B32)","v":0},{"$f":"SUMIFS(iTABUF!$M$11:$M$109,iTABUF!$C$11:$C$109,B32)","v":0},{"$f":"iUI!I32","v":0},{"$f":"iUI!J32","v":0},{"$f":"iUI!L32","v":0}]
[null,"U23",null,{"$f":"IF(iUI!D33<>\"\",iUI!D33,\"\")","v":""},{"$f":"IF(iUI!F33<>\"\",iUI!F33,\"\")","v":""},{"$f":"SUMIFS(iTABUF!$D$11:$D$109,iTABUF!$C$11:$C$109,B33)","v":0},{"$f":"SUMIFS(iTABUF!$E$11:$E$109,iTABUF!$C$11:$C$109,B33)","v":0},{"$f":"SUMIFS(iTABUF!$F$11:$F$109,iTABUF!$C$11:$C$109,B33)","v":0},{"$f":"SUMIFS(iTABUF!$G$11:$G$109,iTABUF!$C$11:$C$109,B33)","v":0},{"$f":"SUMIFS(iTABUF!$H$11:$H$109,iTABUF!$C$11:$C$109,B33)","v":0},{"$f":"SUMIFS(iTABUF!$I$11:$I$109,iTABUF!$C$11:$C$109,B33)","v":0},{"$f":"SUMIFS(iTABUF!$J$11:$J$109,iTABUF!$C$11:$C$109,B33)","v":0},{"$f":"SUMIFS(iTABUF!$K$11:$K$109,iTABUF!$C$11:$C$109,B33)","v":0},{"$f":"SUMIFS(iTABUF!$L$11:$L$109,iTABUF!$C$11:$C$109,B33)","v":0},{"$f":"SUMIFS(iTABUF!$M$11:$M$109,iTABUF!$C$11:$C$109,B33)","v":0},{"$f":"iUI!I33","v":0},{"$f":"iUI!J33","v":0},{"$f":"iUI!L33","v":0}]
[null,"U24",null,{"$f":"IF(iUI!D34<>\"\",iUI!D34,\"\")","v":""},{"$f":"IF(iUI!F34<>\"\",iUI!F34,\"\")","v":""},{"$f":"SUMIFS(iTABUF!$D$11:$D$109,iTABUF!$C$11:$C$109,B34)","v":0},{"$f":"SUMIFS(iTABUF!$E$11:$E$109,iTABUF!$C$11:$C$109,B34)","v":0},{"$f":"SUMIFS(iTABUF!$F$11:$F$109,iTABUF!$C$11:$C$109,B34)","v":0},{"$f":"SUMIFS(iTABUF!$G$11:$G$109,iTABUF!$C$11:$C$109,B34)","v":0},{"$f":"SUMIFS(iTABUF!$H$11:$H$109,iTABUF!$C$11:$C$109,B34)","v":0},{"$f":"SUMIFS(iTABUF!$I$11:$I$109,iTABUF!$C$11:$C$109,B34)","v":0},{"$f":"SUMIFS(iTABUF!$J$11:$J$109,iTABUF!$C$11:$C$109,B34)","v":0},{"$f":"SUMIFS(iTABUF!$K$11:$K$109,iTABUF!$C$11:$C$109,B34)","v":0},{"$f":"SUMIFS(iTABUF!$L$11:$L$109,iTABUF!$C$11:$C$109,B34)","v":0},{"$f":"SUMIFS(iTABUF!$M$11:$M$109,iTABUF!$C$11:$C$109,B34)","v":0},{"$f":"iUI!I34","v":0},{"$f":"iUI!J34","v":0},{"$f":"iUI!L34","v":0}]
[null,"U25",null,{"$f":"IF(iUI!D35<>\"\",iUI!D35,\"\")","v":""},{"$f":"IF(iUI!F35<>\"\",iUI!F35,\"\")","v":""},{"$f":"SUMIFS(iTABUF!$D$11:$D$109,iTABUF!$C$11:$C$109,B35)","v":0},{"$f":"SUMIFS(iTABUF!$E$11:$E$109,iTABUF!$C$11:$C$109,B35)","v":0},{"$f":"SUMIFS(iTABUF!$F$11:$F$109,iTABUF!$C$11:$C$109,B35)","v":0},{"$f":"SUMIFS(iTABUF!$G$11:$G$109,iTABUF!$C$11:$C$109,B35)","v":0},{"$f":"SUMIFS(iTABUF!$H$11:$H$109,iTABUF!$C$11:$C$109,B35)","v":0},{"$f":"SUMIFS(iTABUF!$I$11:$I$109,iTABUF!$C$11:$C$109,B35)","v":0},{"$f":"SUMIFS(iTABUF!$J$11:$J$109,iTABUF!$C$11:$C$109,B35)","v":0},{"$f":"SUMIFS(iTABUF!$K$11:$K$109,iTABUF!$C$11:$C$109,B35)","v":0},{"$f":"SUMIFS(iTABUF!$L$11:$L$109,iTABUF!$C$11:$C$109,B35)","v":0},{"$f":"SUMIFS(iTABUF!$M$11:$M$109,iTABUF!$C$11:$C$109,B35)","v":0},{"$f":"iUI!I35","v":0},{"$f":"iUI!J35","v":0},{"$f":"iUI!L35","v":0}]
[null,"U26",null,{"$f":"IF(iUI!D36<>\"\",iUI!D36,\"\")","v":""},{"$f":"IF(iUI!F36<>\"\",iUI!F36,\"\")","v":""},{"$f":"SUMIFS(iTABUF!$D$11:$D$109,iTABUF!$C$11:$C$109,B36)","v":0},{"$f":"SUMIFS(iTABUF!$E$11:$E$109,iTABUF!$C$11:$C$109,B36)","v":0},{"$f":"SUMIFS(iTABUF!$F$11:$F$109,iTABUF!$C$11:$C$109,B36)","v":0},{"$f":"SUMIFS(iTABUF!$G$11:$G$109,iTABUF!$C$11:$C$109,B36)","v":0},{"$f":"SUMIFS(iTABUF!$H$11:$H$109,iTABUF!$C$11:$C$109,B36)","v":0},{"$f":"SUMIFS(iTABUF!$I$11:$I$109,iTABUF!$C$11:$C$109,B36)","v":0},{"$f":"SUMIFS(iTABUF!$J$11:$J$109,iTABUF!$C$11:$C$109,B36)","v":0},{"$f":"SUMIFS(iTABUF!$K$11:$K$109,iTABUF!$C$11:$C$109,B36)","v":0},{"$f":"SUMIFS(iTABUF!$L$11:$L$109,iTABUF!$C$11:$C$109,B36)","v":0},{"$f":"SUMIFS(iTABUF!$M$11:$M$109,iTABUF!$C$11:$C$109,B36)","v":0},{"$f":"iUI!I36","v":0},{"$f":"iUI!J36","v":0},{"$f":"iUI!L36","v":0}]
[null,"U27",null,{"$f":"IF(iUI!D37<>\"\",iUI!D37,\"\")","v":""},{"$f":"IF(iUI!F37<>\"\",iUI!F37,\"\")","v":""},{"$f":"SUMIFS(iTABUF!$D$11:$D$109,iTABUF!$C$11:$C$109,B37)","v":0},{"$f":"SUMIFS(iTABUF!$E$11:$E$109,iTABUF!$C$11:$C$109,B37)","v":0},{"$f":"SUMIFS(iTABUF!$F$11:$F$109,iTABUF!$C$11:$C$109,B37)","v":0},{"$f":"SUMIFS(iTABUF!$G$11:$G$109,iTABUF!$C$11:$C$109,B37)","v":0},{"$f":"SUMIFS(iTABUF!$H$11:$H$109,iTABUF!$C$11:$C$109,B37)","v":0},{"$f":"SUMIFS(iTABUF!$I$11:$I$109,iTABUF!$C$11:$C$109,B37)","v":0},{"$f":"SUMIFS(iTABUF!$J$11:$J$109,iTABUF!$C$11:$C$109,B37)","v":0},{"$f":"SUMIFS(iTABUF!$K$11:$K$109,iTABUF!$C$11:$C$109,B37)","v":0},{"$f":"SUMIFS(iTABUF!$L$11:$L$109,iTABUF!$C$11:$C$109,B37)","v":0},{"$f":"SUMIFS(iTABUF!$M$11:$M$109,iTABUF!$C$11:$C$109,B37)","v":0},{"$f":"iUI!I37","v":0},{"$f":"iUI!J37","v":0},{"$f":"iUI!L37","v":0}]
[null,"U28",null,{"$f":"IF(iUI!D38<>\"\",iUI!D38,\"\")","v":""},{"$f":"IF(iUI!F38<>\"\",iUI!F38,\"\")","v":""},{"$f":"SUMIFS(iTABUF!$D$11:$D$109,iTABUF!$C$11:$C$109,B38)","v":0},{"$f":"SUMIFS(iTABUF!$E$11:$E$109,iTABUF!$C$11:$C$109,B38)","v":0},{"$f":"SUMIFS(iTABUF!$F$11:$F$109,iTABUF!$C$11:$C$109,B38)","v":0},{"$f":"SUMIFS(iTABUF!$G$11:$G$109,iTABUF!$C$11:$C$109,B38)","v":0},{"$f":"SUMIFS(iTABUF!$H$11:$H$109,iTABUF!$C$11:$C$109,B38)","v":0},{"$f":"SUMIFS(iTABUF!$I$11:$I$109,iTABUF!$C$11:$C$109,B38)","v":0},{"$f":"SUMIFS(iTABUF!$J$11:$J$109,iTABUF!$C$11:$C$109,B38)","v":0},{"$f":"SUMIFS(iTABUF!$K$11:$K$109,iTABUF!$C$11:$C$109,B38)","v":0},{"$f":"SUMIFS(iTABUF!$L$11:$L$109,iTABUF!$C$11:$C$109,B38)","v":0},{"$f":"SUMIFS(iTABUF!$M$11:$M$109,iTABUF!$C$11:$C$109,B38)","v":0},{"$f":"iUI!I38","v":0},{"$f":"iUI!J38","v":0},{"$f":"iUI!L38","v":0}]
[null,"U29",null,{"$f":"IF(iUI!D39<>\"\",iUI!D39,\"\")","v":""},{"$f":"IF(iUI!F39<>\"\",iUI!F39,\"\")","v":""},{"$f":"SUMIFS(iTABUF!$D$11:$D$109,iTABUF!$C$11:$C$109,B39)","v":0},{"$f":"SUMIFS(iTABUF!$E$11:$E$109,iTABUF!$C$11:$C$109,B39)","v":0},{"$f":"SUMIFS(iTABUF!$F$11:$F$109,iTABUF!$C$11:$C$109,B39)","v":0},{"$f":"SUMIFS(iTABUF!$G$11:$G$109,iTABUF!$C$11:$C$109,B39)","v":0},{"$f":"SUMIFS(iTABUF!$H$11:$H$109,iTABUF!$C$11:$C$109,B39)","v":0},{"$f":"SUMIFS(iTABUF!$I$11:$I$109,iTABUF!$C$11:$C$109,B39)","v":0},{"$f":"SUMIFS(iTABUF!$J$11:$J$109,iTABUF!$C$11:$C$109,B39)","v":0},{"$f":"SUMIFS(iTABUF!$K$11:$K$109,iTABUF!$C$11:$C$109,B39)","v":0},{"$f":"SUMIFS(iTABUF!$L$11:$L$109,iTABUF!$C$11:$C$109,B39)","v":0},{"$f":"SUMIFS(iTABUF!$M$11:$M$109,iTABUF!$C$11:$C$109,B39)","v":0},{"$f":"iUI!I39","v":0},{"$f":"iUI!J39","v":0},{"$f":"iUI!L39","v":0}]
[null,"U30",null,{"$f":"IF(iUI!D40<>\"\",iUI!D40,\"\")","v":""},{"$f":"IF(iUI!F40<>\"\",iUI!F40,\"\")","v":""},{"$f":"SUMIFS(iTABUF!$D$11:$D$109,iTABUF!$C$11:$C$109,B40)","v":0},{"$f":"SUMIFS(iTABUF!$E$11:$E$109,iTABUF!$C$11:$C$109,B40)","v":0},{"$f":"SUMIFS(iTABUF!$F$11:$F$109,iTABUF!$C$11:$C$109,B40)","v":0},{"$f":"SUMIFS(iTABUF!$G$11:$G$109,iTABUF!$C$11:$C$109,B40)","v":0},{"$f":"SUMIFS(iTABUF!$H$11:$H$109,iTABUF!$C$11:$C$109,B40)","v":0},{"$f":"SUMIFS(iTABUF!$I$11:$I$109,iTABUF!$C$11:$C$109,B40)","v":0},{"$f":"SUMIFS(iTABUF!$J$11:$J$109,iTABUF!$C$11:$C$109,B40)","v":0},{"$f":"SUMIFS(iTABUF!$K$11:$K$109,iTABUF!$C$11:$C$109,B40)","v":0},{"$f":"SUMIFS(iTABUF!$L$11:$L$109,iTABUF!$C$11:$C$109,B40)","v":0},{"$f":"SUMIFS(iTABUF!$M$11:$M$109,iTABUF!$C$11:$C$109,B40)","v":0},{"$f":"iUI!I40","v":0},{"$f":"iUI!J40","v":0},{"$f":"iUI!L40","v":0}]
[null,"U31",null,{"$f":"IF(iUI!D41<>\"\",iUI!D41,\"\")","v":""},{"$f":"IF(iUI!F41<>\"\",iUI!F41,\"\")","v":""},{"$f":"SUMIFS(iTABUF!$D$11:$D$109,iTABUF!$C$11:$C$109,B41)","v":0},{"$f":"SUMIFS(iTABUF!$E$11:$E$109,iTABUF!$C$11:$C$109,B41)","v":0},{"$f":"SUMIFS(iTABUF!$F$11:$F$109,iTABUF!$C$11:$C$109,B41)","v":0},{"$f":"SUMIFS(iTABUF!$G$11:$G$109,iTABUF!$C$11:$C$109,B41)","v":0},{"$f":"SUMIFS(iTABUF!$H$11:$H$109,iTABUF!$C$11:$C$109,B41)","v":0},{"$f":"SUMIFS(iTABUF!$I$11:$I$109,iTABUF!$C$11:$C$109,B41)","v":0},{"$f":"SUMIFS(iTABUF!$J$11:$J$109,iTABUF!$C$11:$C$109,B41)","v":0},{"$f":"SUMIFS(iTABUF!$K$11:$K$109,iTABUF!$C$11:$C$109,B41)","v":0},{"$f":"SUMIFS(iTABUF!$L$11:$L$109,iTABUF!$C$11:$C$109,B41)","v":0},{"$f":"SUMIFS(iTABUF!$M$11:$M$109,iTABUF!$C$11:$C$109,B41)","v":0},{"$f":"iUI!I41","v":0},{"$f":"iUI!J41","v":0},{"$f":"iUI!L41","v":0}]
[null,"U32",null,{"$f":"IF(iUI!D42<>\"\",iUI!D42,\"\")","v":""},{"$f":"IF(iUI!F42<>\"\",iUI!F42,\"\")","v":""},{"$f":"SUMIFS(iTABUF!$D$11:$D$109,iTABUF!$C$11:$C$109,B42)","v":0},{"$f":"SUMIFS(iTABUF!$E$11:$E$109,iTABUF!$C$11:$C$109,B42)","v":0},{"$f":"SUMIFS(iTABUF!$F$11:$F$109,iTABUF!$C$11:$C$109,B42)","v":0},{"$f":"SUMIFS(iTABUF!$G$11:$G$109,iTABUF!$C$11:$C$109,B42)","v":0},{"$f":"SUMIFS(iTABUF!$H$11:$H$109,iTABUF!$C$11:$C$109,B42)","v":0},{"$f":"SUMIFS(iTABUF!$I$11:$I$109,iTABUF!$C$11:$C$109,B42)","v":0},{"$f":"SUMIFS(iTABUF!$J$11:$J$109,iTABUF!$C$11:$C$109,B42)","v":0},{"$f":"SUMIFS(iTABUF!$K$11:$K$109,iTABUF!$C$11:$C$109,B42)","v":0},{"$f":"SUMIFS(iTABUF!$L$11:$L$109,iTABUF!$C$11:$C$109,B42)","v":0},{"$f":"SUMIFS(iTABUF!$M$11:$M$109,iTABUF!$C$11:$C$109,B42)","v":0},{"$f":"iUI!I42","v":0},{"$f":"iUI!J42","v":0},{"$f":"iUI!L42","v":0}]
[null,"U33",null,{"$f":"IF(iUI!D43<>\"\",iUI!D43,\"\")","v":""},{"$f":"IF(iUI!F43<>\"\",iUI!F43,\"\")","v":""},{"$f":"SUMIFS(iTABUF!$D$11:$D$109,iTABUF!$C$11:$C$109,B43)","v":0},{"$f":"SUMIFS(iTABUF!$E$11:$E$109,iTABUF!$C$11:$C$109,B43)","v":0},{"$f":"SUMIFS(iTABUF!$F$11:$F$109,iTABUF!$C$11:$C$109,B43)","v":0},{"$f":"SUMIFS(iTABUF!$G$11:$G$109,iTABUF!$C$11:$C$109,B43)","v":0},{"$f":"SUMIFS(iTABUF!$H$11:$H$109,iTABUF!$C$11:$C$109,B43)","v":0},{"$f":"SUMIFS(iTABUF!$I$11:$I$109,iTABUF!$C$11:$C$109,B43)","v":0},{"$f":"SUMIFS(iTABUF!$J$11:$J$109,iTABUF!$C$11:$C$109,B43)","v":0},{"$f":"SUMIFS(iTABUF!$K$11:$K$109,iTABUF!$C$11:$C$109,B43)","v":0},{"$f":"SUMIFS(iTABUF!$L$11:$L$109,iTABUF!$C$11:$C$109,B43)","v":0},{"$f":"SUMIFS(iTABUF!$M$11:$M$109,iTABUF!$C$11:$C$109,B43)","v":0},{"$f":"iUI!I43","v":0},{"$f":"iUI!J43","v":0},{"$f":"iUI!L43","v":0}]
[null,"U34",null,{"$f":"IF(iUI!D44<>\"\",iUI!D44,\"\")","v":""},{"$f":"IF(iUI!F44<>\"\",iUI!F44,\"\")","v":""},{"$f":"SUMIFS(iTABUF!$D$11:$D$109,iTABUF!$C$11:$C$109,B44)","v":0},{"$f":"SUMIFS(iTABUF!$E$11:$E$109,iTABUF!$C$11:$C$109,B44)","v":0},{"$f":"SUMIFS(iTABUF!$F$11:$F$109,iTABUF!$C$11:$C$109,B44)","v":0},{"$f":"SUMIFS(iTABUF!$G$11:$G$109,iTABUF!$C$11:$C$109,B44)","v":0},{"$f":"SUMIFS(iTABUF!$H$11:$H$109,iTABUF!$C$11:$C$109,B44)","v":0},{"$f":"SUMIFS(iTABUF!$I$11:$I$109,iTABUF!$C$11:$C$109,B44)","v":0},{"$f":"SUMIFS(iTABUF!$J$11:$J$109,iTABUF!$C$11:$C$109,B44)","v":0},{"$f":"SUMIFS(iTABUF!$K$11:$K$109,iTABUF!$C$11:$C$109,B44)","v":0},{"$f":"SUMIFS(iTABUF!$L$11:$L$109,iTABUF!$C$11:$C$109,B44)","v":0},{"$f":"SUMIFS(iTABUF!$M$11:$M$109,iTABUF!$C$11:$C$109,B44)","v":0},{"$f":"iUI!I44","v":0},{"$f":"iUI!J44","v":0},{"$f":"iUI!L44","v":0}]
[null,"U35",null,{"$f":"IF(iUI!D45<>\"\",iUI!D45,\"\")","v":""},{"$f":"IF(iUI!F45<>\"\",iUI!F45,\"\")","v":""},{"$f":"SUMIFS(iTABUF!$D$11:$D$109,iTABUF!$C$11:$C$109,B45)","v":0},{"$f":"SUMIFS(iTABUF!$E$11:$E$109,iTABUF!$C$11:$C$109,B45)","v":0},{"$f":"SUMIFS(iTABUF!$F$11:$F$109,iTABUF!$C$11:$C$109,B45)","v":0},{"$f":"SUMIFS(iTABUF!$G$11:$G$109,iTABUF!$C$11:$C$109,B45)","v":0},{"$f":"SUMIFS(iTABUF!$H$11:$H$109,iTABUF!$C$11:$C$109,B45)","v":0},{"$f":"SUMIFS(iTABUF!$I$11:$I$109,iTABUF!$C$11:$C$109,B45)","v":0},{"$f":"SUMIFS(iTABUF!$J$11:$J$109,iTABUF!$C$11:$C$109,B45)","v":0},{"$f":"SUMIFS(iTABUF!$K$11:$K$109,iTABUF!$C$11:$C$109,B45)","v":0},{"$f":"SUMIFS(iTABUF!$L$11:$L$109,iTABUF!$C$11:$C$109,B45)","v":0},{"$f":"SUMIFS(iTABUF!$M$11:$M$109,iTABUF!$C$11:$C$109,B45)","v":0},{"$f":"iUI!I45","v":0},{"$f":"iUI!J45","v":0},{"$f":"iUI!L45","v":0}]
[null,"U36",null,{"$f":"IF(iUI!D46<>\"\",iUI!D46,\"\")","v":""},{"$f":"IF(iUI!F46<>\"\",iUI!F46,\"\")","v":""},{"$f":"SUMIFS(iTABUF!$D$11:$D$109,iTABUF!$C$11:$C$109,B46)","v":0},{"$f":"SUMIFS(iTABUF!$E$11:$E$109,iTABUF!$C$11:$C$109,B46)","v":0},{"$f":"SUMIFS(iTABUF!$F$11:$F$109,iTABUF!$C$11:$C$109,B46)","v":0},{"$f":"SUMIFS(iTABUF!$G$11:$G$109,iTABUF!$C$11:$C$109,B46)","v":0},{"$f":"SUMIFS(iTABUF!$H$11:$H$109,iTABUF!$C$11:$C$109,B46)","v":0},{"$f":"SUMIFS(iTABUF!$I$11:$I$109,iTABUF!$C$11:$C$109,B46)","v":0},{"$f":"SUMIFS(iTABUF!$J$11:$J$109,iTABUF!$C$11:$C$109,B46)","v":0},{"$f":"SUMIFS(iTABUF!$K$11:$K$109,iTABUF!$C$11:$C$109,B46)","v":0},{"$f":"SUMIFS(iTABUF!$L$11:$L$109,iTABUF!$C$11:$C$109,B46)","v":0},{"$f":"SUMIFS(iTABUF!$M$11:$M$109,iTABUF!$C$11:$C$109,B46)","v":0},{"$f":"iUI!I46","v":0},{"$f":"iUI!J46","v":0},{"$f":"iUI!L46","v":0}]
[null,"U37",null,{"$f":"IF(iUI!D47<>\"\",iUI!D47,\"\")","v":""},{"$f":"IF(iUI!F47<>\"\",iUI!F47,\"\")","v":""},{"$f":"SUMIFS(iTABUF!$D$11:$D$109,iTABUF!$C$11:$C$109,B47)","v":0},{"$f":"SUMIFS(iTABUF!$E$11:$E$109,iTABUF!$C$11:$C$109,B47)","v":0},{"$f":"SUMIFS(iTABUF!$F$11:$F$109,iTABUF!$C$11:$C$109,B47)","v":0},{"$f":"SUMIFS(iTABUF!$G$11:$G$109,iTABUF!$C$11:$C$109,B47)","v":0},{"$f":"SUMIFS(iTABUF!$H$11:$H$109,iTABUF!$C$11:$C$109,B47)","v":0},{"$f":"SUMIFS(iTABUF!$I$11:$I$109,iTABUF!$C$11:$C$109,B47)","v":0},{"$f":"SUMIFS(iTABUF!$J$11:$J$109,iTABUF!$C$11:$C$109,B47)","v":0},{"$f":"SUMIFS(iTABUF!$K$11:$K$109,iTABUF!$C$11:$C$109,B47)","v":0},{"$f":"SUMIFS(iTABUF!$L$11:$L$109,iTABUF!$C$11:$C$109,B47)","v":0},{"$f":"SUMIFS(iTABUF!$M$11:$M$109,iTABUF!$C$11:$C$109,B47)","v":0},{"$f":"iUI!I47","v":0},{"$f":"iUI!J47","v":0},{"$f":"iUI!L47","v":0}]
[null,"U38",null,{"$f":"IF(iUI!D48<>\"\",iUI!D48,\"\")","v":""},{"$f":"IF(iUI!F48<>\"\",iUI!F48,\"\")","v":""},{"$f":"SUMIFS(iTABUF!$D$11:$D$109,iTABUF!$C$11:$C$109,B48)","v":0},{"$f":"SUMIFS(iTABUF!$E$11:$E$109,iTABUF!$C$11:$C$109,B48)","v":0},{"$f":"SUMIFS(iTABUF!$F$11:$F$109,iTABUF!$C$11:$C$109,B48)","v":0},{"$f":"SUMIFS(iTABUF!$G$11:$G$109,iTABUF!$C$11:$C$109,B48)","v":0},{"$f":"SUMIFS(iTABUF!$H$11:$H$109,iTABUF!$C$11:$C$109,B48)","v":0},{"$f":"SUMIFS(iTABUF!$I$11:$I$109,iTABUF!$C$11:$C$109,B48)","v":0},{"$f":"SUMIFS(iTABUF!$J$11:$J$109,iTABUF!$C$11:$C$109,B48)","v":0},{"$f":"SUMIFS(iTABUF!$K$11:$K$109,iTABUF!$C$11:$C$109,B48)","v":0},{"$f":"SUMIFS(iTABUF!$L$11:$L$109,iTABUF!$C$11:$C$109,B48)","v":0},{"$f":"SUMIFS(iTABUF!$M$11:$M$109,iTABUF!$C$11:$C$109,B48)","v":0},{"$f":"iUI!I48","v":0},{"$f":"iUI!J48","v":0},{"$f":"iUI!L48","v":0}]
[null,"U39",null,{"$f":"IF(iUI!D49<>\"\",iUI!D49,\"\")","v":""},{"$f":"IF(iUI!F49<>\"\",iUI!F49,\"\")","v":""},{"$f":"SUMIFS(iTABUF!$D$11:$D$109,iTABUF!$C$11:$C$109,B49)","v":0},{"$f":"SUMIFS(iTABUF!$E$11:$E$109,iTABUF!$C$11:$C$109,B49)","v":0},{"$f":"SUMIFS(iTABUF!$F$11:$F$109,iTABUF!$C$11:$C$109,B49)","v":0},{"$f":"SUMIFS(iTABUF!$G$11:$G$109,iTABUF!$C$11:$C$109,B49)","v":0},{"$f":"SUMIFS(iTABUF!$H$11:$H$109,iTABUF!$C$11:$C$109,B49)","v":0},{"$f":"SUMIFS(iTABUF!$I$11:$I$109,iTABUF!$C$11:$C$109,B49)","v":0},{"$f":"SUMIFS(iTABUF!$J$11:$J$109,iTABUF!$C$11:$C$109,B49)","v":0},{"$f":"SUMIFS(iTABUF!$K$11:$K$109,iTABUF!$C$11:$C$109,B49)","v":0},{"$f":"SUMIFS(iTABUF!$L$11:$L$109,iTABUF!$C$11:$C$109,B49)","v":0},{"$f":"SUMIFS(iTABUF!$M$11:$M$109,iTABUF!$C$11:$C$109,B49)","v":0},{"$f":"iUI!I49","v":0},{"$f":"iUI!J49","v":0},{"$f":"iUI!L49","v":0}]
[null,"U40",null,{"$f":"IF(iUI!D50<>\"\",iUI!D50,\"\")","v":""},{"$f":"IF(iUI!F50<>\"\",iUI!F50,\"\")","v":""},{"$f":"SUMIFS(iTABUF!$D$11:$D$109,iTABUF!$C$11:$C$109,B50)","v":0},{"$f":"SUMIFS(iTABUF!$E$11:$E$109,iTABUF!$C$11:$C$109,B50)","v":0},{"$f":"SUMIFS(iTABUF!$F$11:$F$109,iTABUF!$C$11:$C$109,B50)","v":0},{"$f":"SUMIFS(iTABUF!$G$11:$G$109,iTABUF!$C$11:$C$109,B50)","v":0},{"$f":"SUMIFS(iTABUF!$H$11:$H$109,iTABUF!$C$11:$C$109,B50)","v":0},{"$f":"SUMIFS(iTABUF!$I$11:$I$109,iTABUF!$C$11:$C$109,B50)","v":0},{"$f":"SUMIFS(iTABUF!$J$11:$J$109,iTABUF!$C$11:$C$109,B50)","v":0},{"$f":"SUMIFS(iTABUF!$K$11:$K$109,iTABUF!$C$11:$C$109,B50)","v":0},{"$f":"SUMIFS(iTABUF!$L$11:$L$109,iTABUF!$C$11:$C$109,B50)","v":0},{"$f":"SUMIFS(iTABUF!$M$11:$M$109,iTABUF!$C$11:$C$109,B50)","v":0},{"$f":"iUI!I50","v":0},{"$f":"iUI!J50","v":0},{"$f":"iUI!L50","v":0}]
[null,"U41",null,{"$f":"IF(iUI!D51<>\"\",iUI!D51,\"\")","v":""},{"$f":"IF(iUI!F51<>\"\",iUI!F51,\"\")","v":""},{"$f":"SUMIFS(iTABUF!$D$11:$D$109,iTABUF!$C$11:$C$109,B51)","v":0},{"$f":"SUMIFS(iTABUF!$E$11:$E$109,iTABUF!$C$11:$C$109,B51)","v":0},{"$f":"SUMIFS(iTABUF!$F$11:$F$109,iTABUF!$C$11:$C$109,B51)","v":0},{"$f":"SUMIFS(iTABUF!$G$11:$G$109,iTABUF!$C$11:$C$109,B51)","v":0},{"$f":"SUMIFS(iTABUF!$H$11:$H$109,iTABUF!$C$11:$C$109,B51)","v":0},{"$f":"SUMIFS(iTABUF!$I$11:$I$109,iTABUF!$C$11:$C$109,B51)","v":0},{"$f":"SUMIFS(iTABUF!$J$11:$J$109,iTABUF!$C$11:$C$109,B51)","v":0},{"$f":"SUMIFS(iTABUF!$K$11:$K$109,iTABUF!$C$11:$C$109,B51)","v":0},{"$f":"SUMIFS(iTABUF!$L$11:$L$109,iTABUF!$C$11:$C$109,B51)","v":0},{"$f":"SUMIFS(iTABUF!$M$11:$M$109,iTABUF!$C$11:$C$109,B51)","v":0},{"$f":"iUI!I51","v":0},{"$f":"iUI!J51","v":0},{"$f":"iUI!L51","v":0}]
[null,"U42",null,{"$f":"IF(iUI!D52<>\"\",iUI!D52,\"\")","v":""},{"$f":"IF(iUI!F52<>\"\",iUI!F52,\"\")","v":""},{"$f":"SUMIFS(iTABUF!$D$11:$D$109,iTABUF!$C$11:$C$109,B52)","v":0},{"$f":"SUMIFS(iTABUF!$E$11:$E$109,iTABUF!$C$11:$C$109,B52)","v":0},{"$f":"SUMIFS(iTABUF!$F$11:$F$109,iTABUF!$C$11:$C$109,B52)","v":0},{"$f":"SUMIFS(iTABUF!$G$11:$G$109,iTABUF!$C$11:$C$109,B52)","v":0},{"$f":"SUMIFS(iTABUF!$H$11:$H$109,iTABUF!$C$11:$C$109,B52)","v":0},{"$f":"SUMIFS(iTABUF!$I$11:$I$109,iTABUF!$C$11:$C$109,B52)","v":0},{"$f":"SUMIFS(iTABUF!$J$11:$J$109,iTABUF!$C$11:$C$109,B52)","v":0},{"$f":"SUMIFS(iTABUF!$K$11:$K$109,iTABUF!$C$11:$C$109,B52)","v":0},{"$f":"SUMIFS(iTABUF!$L$11:$L$109,iTABUF!$C$11:$C$109,B52)","v":0},{"$f":"SUMIFS(iTABUF!$M$11:$M$109,iTABUF!$C$11:$C$109,B52)","v":0},{"$f":"iUI!I52","v":0},{"$f":"iUI!J52","v":0},{"$f":"iUI!L52","v":0}]
[null,"U43",null,{"$f":"IF(iUI!D53<>\"\",iUI!D53,\"\")","v":""},{"$f":"IF(iUI!F53<>\"\",iUI!F53,\"\")","v":""},{"$f":"SUMIFS(iTABUF!$D$11:$D$109,iTABUF!$C$11:$C$109,B53)","v":0},{"$f":"SUMIFS(iTABUF!$E$11:$E$109,iTABUF!$C$11:$C$109,B53)","v":0},{"$f":"SUMIFS(iTABUF!$F$11:$F$109,iTABUF!$C$11:$C$109,B53)","v":0},{"$f":"SUMIFS(iTABUF!$G$11:$G$109,iTABUF!$C$11:$C$109,B53)","v":0},{"$f":"SUMIFS(iTABUF!$H$11:$H$109,iTABUF!$C$11:$C$109,B53)","v":0},{"$f":"SUMIFS(iTABUF!$I$11:$I$109,iTABUF!$C$11:$C$109,B53)","v":0},{"$f":"SUMIFS(iTABUF!$J$11:$J$109,iTABUF!$C$11:$C$109,B53)","v":0},{"$f":"SUMIFS(iTABUF!$K$11:$K$109,iTABUF!$C$11:$C$109,B53)","v":0},{"$f":"SUMIFS(iTABUF!$L$11:$L$109,iTABUF!$C$11:$C$109,B53)","v":0},{"$f":"SUMIFS(iTABUF!$M$11:$M$109,iTABUF!$C$11:$C$109,B53)","v":0},{"$f":"iUI!I53","v":0},{"$f":"iUI!J53","v":0},{"$f":"iUI!L53","v":0}]
[null,"U44",null,{"$f":"IF(iUI!D54<>\"\",iUI!D54,\"\")","v":""},{"$f":"IF(iUI!F54<>\"\",iUI!F54,\"\")","v":""},{"$f":"SUMIFS(iTABUF!$D$11:$D$109,iTABUF!$C$11:$C$109,B54)","v":0},{"$f":"SUMIFS(iTABUF!$E$11:$E$109,iTABUF!$C$11:$C$109,B54)","v":0},{"$f":"SUMIFS(iTABUF!$F$11:$F$109,iTABUF!$C$11:$C$109,B54)","v":0},{"$f":"SUMIFS(iTABUF!$G$11:$G$109,iTABUF!$C$11:$C$109,B54)","v":0},{"$f":"SUMIFS(iTABUF!$H$11:$H$109,iTABUF!$C$11:$C$109,B54)","v":0},{"$f":"SUMIFS(iTABUF!$I$11:$I$109,iTABUF!$C$11:$C$109,B54)","v":0},{"$f":"SUMIFS(iTABUF!$J$11:$J$109,iTABUF!$C$11:$C$109,B54)","v":0},{"$f":"SUMIFS(iTABUF!$K$11:$K$109,iTABUF!$C$11:$C$109,B54)","v":0},{"$f":"SUMIFS(iTABUF!$L$11:$L$109,iTABUF!$C$11:$C$109,B54)","v":0},{"$f":"SUMIFS(iTABUF!$M$11:$M$109,iTABUF!$C$11:$C$109,B54)","v":0},{"$f":"iUI!I54","v":0},{"$f":"iUI!J54","v":0},{"$f":"iUI!L54","v":0}]
[null,"U45",null,{"$f":"IF(iUI!D55<>\"\",iUI!D55,\"\")","v":""},{"$f":"IF(iUI!F55<>\"\",iUI!F55,\"\")","v":""},{"$f":"SUMIFS(iTABUF!$D$11:$D$109,iTABUF!$C$11:$C$109,B55)","v":0},{"$f":"SUMIFS(iTABUF!$E$11:$E$109,iTABUF!$C$11:$C$109,B55)","v":0},{"$f":"SUMIFS(iTABUF!$F$11:$F$109,iTABUF!$C$11:$C$109,B55)","v":0},{"$f":"SUMIFS(iTABUF!$G$11:$G$109,iTABUF!$C$11:$C$109,B55)","v":0},{"$f":"SUMIFS(iTABUF!$H$11:$H$109,iTABUF!$C$11:$C$109,B55)","v":0},{"$f":"SUMIFS(iTABUF!$I$11:$I$109,iTABUF!$C$11:$C$109,B55)","v":0},{"$f":"SUMIFS(iTABUF!$J$11:$J$109,iTABUF!$C$11:$C$109,B55)","v":0},{"$f":"SUMIFS(iTABUF!$K$11:$K$109,iTABUF!$C$11:$C$109,B55)","v":0},{"$f":"SUMIFS(iTABUF!$L$11:$L$109,iTABUF!$C$11:$C$109,B55)","v":0},{"$f":"SUMIFS(iTABUF!$M$11:$M$109,iTABUF!$C$11:$C$109,B55)","v":0},{"$f":"iUI!I55","v":0},{"$f":"iUI!J55","v":0},{"$f":"iUI!L55","v":0}]
[null,"U46",null,{"$f":"IF(iUI!D56<>\"\",iUI!D56,\"\")","v":""},{"$f":"IF(iUI!F56<>\"\",iUI!F56,\"\")","v":""},{"$f":"SUMIFS(iTABUF!$D$11:$D$109,iTABUF!$C$11:$C$109,B56)","v":0},{"$f":"SUMIFS(iTABUF!$E$11:$E$109,iTABUF!$C$11:$C$109,B56)","v":0},{"$f":"SUMIFS(iTABUF!$F$11:$F$109,iTABUF!$C$11:$C$109,B56)","v":0},{"$f":"SUMIFS(iTABUF!$G$11:$G$109,iTABUF!$C$11:$C$109,B56)","v":0},{"$f":"SUMIFS(iTABUF!$H$11:$H$109,iTABUF!$C$11:$C$109,B56)","v":0},{"$f":"SUMIFS(iTABUF!$I$11:$I$109,iTABUF!$C$11:$C$109,B56)","v":0},{"$f":"SUMIFS(iTABUF!$J$11:$J$109,iTABUF!$C$11:$C$109,B56)","v":0},{"$f":"SUMIFS(iTABUF!$K$11:$K$109,iTABUF!$C$11:$C$109,B56)","v":0},{"$f":"SUMIFS(iTABUF!$L$11:$L$109,iTABUF!$C$11:$C$109,B56)","v":0},{"$f":"SUMIFS(iTABUF!$M$11:$M$109,iTABUF!$C$11:$C$109,B56)","v":0},{"$f":"iUI!I56","v":0},{"$f":"iUI!J56","v":0},{"$f":"iUI!L56","v":0}]
[null,"U47",null,{"$f":"IF(iUI!D57<>\"\",iUI!D57,\"\")","v":""},{"$f":"IF(iUI!F57<>\"\",iUI!F57,\"\")","v":""},{"$f":"SUMIFS(iTABUF!$D$11:$D$109,iTABUF!$C$11:$C$109,B57)","v":0},{"$f":"SUMIFS(iTABUF!$E$11:$E$109,iTABUF!$C$11:$C$109,B57)","v":0},{"$f":"SUMIFS(iTABUF!$F$11:$F$109,iTABUF!$C$11:$C$109,B57)","v":0},{"$f":"SUMIFS(iTABUF!$G$11:$G$109,iTABUF!$C$11:$C$109,B57)","v":0},{"$f":"SUMIFS(iTABUF!$H$11:$H$109,iTABUF!$C$11:$C$109,B57)","v":0},{"$f":"SUMIFS(iTABUF!$I$11:$I$109,iTABUF!$C$11:$C$109,B57)","v":0},{"$f":"SUMIFS(iTABUF!$J$11:$J$109,iTABUF!$C$11:$C$109,B57)","v":0},{"$f":"SUMIFS(iTABUF!$K$11:$K$109,iTABUF!$C$11:$C$109,B57)","v":0},{"$f":"SUMIFS(iTABUF!$L$11:$L$109,iTABUF!$C$11:$C$109,B57)","v":0},{"$f":"SUMIFS(iTABUF!$M$11:$M$109,iTABUF!$C$11:$C$109,B57)","v":0},{"$f":"iUI!I57","v":0},{"$f":"iUI!J57","v":0},{"$f":"iUI!L57","v":0}]
[null,"U48",null,{"$f":"IF(iUI!D58<>\"\",iUI!D58,\"\")","v":""},{"$f":"IF(iUI!F58<>\"\",iUI!F58,\"\")","v":""},{"$f":"SUMIFS(iTABUF!$D$11:$D$109,iTABUF!$C$11:$C$109,B58)","v":0},{"$f":"SUMIFS(iTABUF!$E$11:$E$109,iTABUF!$C$11:$C$109,B58)","v":0},{"$f":"SUMIFS(iTABUF!$F$11:$F$109,iTABUF!$C$11:$C$109,B58)","v":0},{"$f":"SUMIFS(iTABUF!$G$11:$G$109,iTABUF!$C$11:$C$109,B58)","v":0},{"$f":"SUMIFS(iTABUF!$H$11:$H$109,iTABUF!$C$11:$C$109,B58)","v":0},{"$f":"SUMIFS(iTABUF!$I$11:$I$109,iTABUF!$C$11:$C$109,B58)","v":0},{"$f":"SUMIFS(iTABUF!$J$11:$J$109,iTABUF!$C$11:$C$109,B58)","v":0},{"$f":"SUMIFS(iTABUF!$K$11:$K$109,iTABUF!$C$11:$C$109,B58)","v":0},{"$f":"SUMIFS(iTABUF!$L$11:$L$109,iTABUF!$C$11:$C$109,B58)","v":0},{"$f":"SUMIFS(iTABUF!$M$11:$M$109,iTABUF!$C$11:$C$109,B58)","v":0},{"$f":"iUI!I58","v":0},{"$f":"iUI!J58","v":0},{"$f":"iUI!L58","v":0}]
[null,"U49",null,{"$f":"IF(iUI!D59<>\"\",iUI!D59,\"\")","v":""},{"$f":"IF(iUI!F59<>\"\",iUI!F59,\"\")","v":""},{"$f":"SUMIFS(iTABUF!$D$11:$D$109,iTABUF!$C$11:$C$109,B59)","v":0},{"$f":"SUMIFS(iTABUF!$E$11:$E$109,iTABUF!$C$11:$C$109,B59)","v":0},{"$f":"SUMIFS(iTABUF!$F$11:$F$109,iTABUF!$C$11:$C$109,B59)","v":0},{"$f":"SUMIFS(iTABUF!$G$11:$G$109,iTABUF!$C$11:$C$109,B59)","v":0},{"$f":"SUMIFS(iTABUF!$H$11:$H$109,iTABUF!$C$11:$C$109,B59)","v":0},{"$f":"SUMIFS(iTABUF!$I$11:$I$109,iTABUF!$C$11:$C$109,B59)","v":0},{"$f":"SUMIFS(iTABUF!$J$11:$J$109,iTABUF!$C$11:$C$109,B59)","v":0},{"$f":"SUMIFS(iTABUF!$K$11:$K$109,iTABUF!$C$11:$C$109,B59)","v":0},{"$f":"SUMIFS(iTABUF!$L$11:$L$109,iTABUF!$C$11:$C$109,B59)","v":0},{"$f":"SUMIFS(iTABUF!$M$11:$M$109,iTABUF!$C$11:$C$109,B59)","v":0},{"$f":"iUI!I59","v":0},{"$f":"iUI!J59","v":0},{"$f":"iUI!L59","v":0}]
[null,"U50",null,{"$f":"IF(iUI!D60<>\"\",iUI!D60,\"\")","v":""},{"$f":"IF(iUI!F60<>\"\",iUI!F60,\"\")","v":""},{"$f":"SUMIFS(iTABUF!$D$11:$D$109,iTABUF!$C$11:$C$109,B60)","v":0},{"$f":"SUMIFS(iTABUF!$E$11:$E$109,iTABUF!$C$11:$C$109,B60)","v":0},{"$f":"SUMIFS(iTABUF!$F$11:$F$109,iTABUF!$C$11:$C$109,B60)","v":0},{"$f":"SUMIFS(iTABUF!$G$11:$G$109,iTABUF!$C$11:$C$109,B60)","v":0},{"$f":"SUMIFS(iTABUF!$H$11:$H$109,iTABUF!$C$11:$C$109,B60)","v":0},{"$f":"SUMIFS(iTABUF!$I$11:$I$109,iTABUF!$C$11:$C$109,B60)","v":0},{"$f":"SUMIFS(iTABUF!$J$11:$J$109,iTABUF!$C$11:$C$109,B60)","v":0},{"$f":"SUMIFS(iTABUF!$K$11:$K$109,iTABUF!$C$11:$C$109,B60)","v":0},{"$f":"SUMIFS(iTABUF!$L$11:$L$109,iTABUF!$C$11:$C$109,B60)","v":0},{"$f":"SUMIFS(iTABUF!$M$11:$M$109,iTABUF!$C$11:$C$109,B60)","v":0},{"$f":"iUI!I60","v":0},{"$f":"iUI!J60","v":0},{"$f":"iUI!L60","v":0}]
[null,"U51",null,{"$f":"IF(iUI!D61<>\"\",iUI!D61,\"\")","v":""},{"$f":"IF(iUI!F61<>\"\",iUI!F61,\"\")","v":""},{"$f":"SUMIFS(iTABUF!$D$11:$D$109,iTABUF!$C$11:$C$109,B61)","v":0},{"$f":"SUMIFS(iTABUF!$E$11:$E$109,iTABUF!$C$11:$C$109,B61)","v":0},{"$f":"SUMIFS(iTABUF!$F$11:$F$109,iTABUF!$C$11:$C$109,B61)","v":0},{"$f":"SUMIFS(iTABUF!$G$11:$G$109,iTABUF!$C$11:$C$109,B61)","v":0},{"$f":"SUMIFS(iTABUF!$H$11:$H$109,iTABUF!$C$11:$C$109,B61)","v":0},{"$f":"SUMIFS(iTABUF!$I$11:$I$109,iTABUF!$C$11:$C$109,B61)","v":0},{"$f":"SUMIFS(iTABUF!$J$11:$J$109,iTABUF!$C$11:$C$109,B61)","v":0},{"$f":"SUMIFS(iTABUF!$K$11:$K$109,iTABUF!$C$11:$C$109,B61)","v":0},{"$f":"SUMIFS(iTABUF!$L$11:$L$109,iTABUF!$C$11:$C$109,B61)","v":0},{"$f":"SUMIFS(iTABUF!$M$11:$M$109,iTABUF!$C$11:$C$109,B61)","v":0},{"$f":"iUI!I61","v":0},{"$f":"iUI!J61","v":0},{"$f":"iUI!L61","v":0}]
[null,"U52",null,{"$f":"IF(iUI!D62<>\"\",iUI!D62,\"\")","v":""},{"$f":"IF(iUI!F62<>\"\",iUI!F62,\"\")","v":""},{"$f":"SUMIFS(iTABUF!$D$11:$D$109,iTABUF!$C$11:$C$109,B62)","v":0},{"$f":"SUMIFS(iTABUF!$E$11:$E$109,iTABUF!$C$11:$C$109,B62)","v":0},{"$f":"SUMIFS(iTABUF!$F$11:$F$109,iTABUF!$C$11:$C$109,B62)","v":0},{"$f":"SUMIFS(iTABUF!$G$11:$G$109,iTABUF!$C$11:$C$109,B62)","v":0},{"$f":"SUMIFS(iTABUF!$H$11:$H$109,iTABUF!$C$11:$C$109,B62)","v":0},{"$f":"SUMIFS(iTABUF!$I$11:$I$109,iTABUF!$C$11:$C$109,B62)","v":0},{"$f":"SUMIFS(iTABUF!$J$11:$J$109,iTABUF!$C$11:$C$109,B62)","v":0},{"$f":"SUMIFS(iTABUF!$K$11:$K$109,iTABUF!$C$11:$C$109,B62)","v":0},{"$f":"SUMIFS(iTABUF!$L$11:$L$109,iTABUF!$C$11:$C$109,B62)","v":0},{"$f":"SUMIFS(iTABUF!$M$11:$M$109,iTABUF!$C$11:$C$109,B62)","v":0},{"$f":"iUI!I62","v":0},{"$f":"iUI!J62","v":0},{"$f":"iUI!L62","v":0}]
[null,"U53",null,{"$f":"IF(iUI!D63<>\"\",iUI!D63,\"\")","v":""},{"$f":"IF(iUI!F63<>\"\",iUI!F63,\"\")","v":""},{"$f":"SUMIFS(iTABUF!$D$11:$D$109,iTABUF!$C$11:$C$109,B63)","v":0},{"$f":"SUMIFS(iTABUF!$E$11:$E$109,iTABUF!$C$11:$C$109,B63)","v":0},{"$f":"SUMIFS(iTABUF!$F$11:$F$109,iTABUF!$C$11:$C$109,B63)","v":0},{"$f":"SUMIFS(iTABUF!$G$11:$G$109,iTABUF!$C$11:$C$109,B63)","v":0},{"$f":"SUMIFS(iTABUF!$H$11:$H$109,iTABUF!$C$11:$C$109,B63)","v":0},{"$f":"SUMIFS(iTABUF!$I$11:$I$109,iTABUF!$C$11:$C$109,B63)","v":0},{"$f":"SUMIFS(iTABUF!$J$11:$J$109,iTABUF!$C$11:$C$109,B63)","v":0},{"$f":"SUMIFS(iTABUF!$K$11:$K$109,iTABUF!$C$11:$C$109,B63)","v":0},{"$f":"SUMIFS(iTABUF!$L$11:$L$109,iTABUF!$C$11:$C$109,B63)","v":0},{"$f":"SUMIFS(iTABUF!$M$11:$M$109,iTABUF!$C$11:$C$109,B63)","v":0},{"$f":"iUI!I63","v":0},{"$f":"iUI!J63","v":0},{"$f":"iUI!L63","v":0}]
[null,"U54",null,{"$f":"IF(iUI!D64<>\"\",iUI!D64,\"\")","v":""},{"$f":"IF(iUI!F64<>\"\",iUI!F64,\"\")","v":""},{"$f":"SUMIFS(iTABUF!$D$11:$D$109,iTABUF!$C$11:$C$109,B64)","v":0},{"$f":"SUMIFS(iTABUF!$E$11:$E$109,iTABUF!$C$11:$C$109,B64)","v":0},{"$f":"SUMIFS(iTABUF!$F$11:$F$109,iTABUF!$C$11:$C$109,B64)","v":0},{"$f":"SUMIFS(iTABUF!$G$11:$G$109,iTABUF!$C$11:$C$109,B64)","v":0},{"$f":"SUMIFS(iTABUF!$H$11:$H$109,iTABUF!$C$11:$C$109,B64)","v":0},{"$f":"SUMIFS(iTABUF!$I$11:$I$109,iTABUF!$C$11:$C$109,B64)","v":0},{"$f":"SUMIFS(iTABUF!$J$11:$J$109,iTABUF!$C$11:$C$109,B64)","v":0},{"$f":"SUMIFS(iTABUF!$K$11:$K$109,iTABUF!$C$11:$C$109,B64)","v":0},{"$f":"SUMIFS(iTABUF!$L$11:$L$109,iTABUF!$C$11:$C$109,B64)","v":0},{"$f":"SUMIFS(iTABUF!$M$11:$M$109,iTABUF!$C$11:$C$109,B64)","v":0},{"$f":"iUI!I64","v":0},{"$f":"iUI!J64","v":0},{"$f":"iUI!L64","v":0}]
[null,"U55",null,{"$f":"IF(iUI!D65<>\"\",iUI!D65,\"\")","v":""},{"$f":"IF(iUI!F65<>\"\",iUI!F65,\"\")","v":""},{"$f":"SUMIFS(iTABUF!$D$11:$D$109,iTABUF!$C$11:$C$109,B65)","v":0},{"$f":"SUMIFS(iTABUF!$E$11:$E$109,iTABUF!$C$11:$C$109,B65)","v":0},{"$f":"SUMIFS(iTABUF!$F$11:$F$109,iTABUF!$C$11:$C$109,B65)","v":0},{"$f":"SUMIFS(iTABUF!$G$11:$G$109,iTABUF!$C$11:$C$109,B65)","v":0},{"$f":"SUMIFS(iTABUF!$H$11:$H$109,iTABUF!$C$11:$C$109,B65)","v":0},{"$f":"SUMIFS(iTABUF!$I$11:$I$109,iTABUF!$C$11:$C$109,B65)","v":0},{"$f":"SUMIFS(iTABUF!$J$11:$J$109,iTABUF!$C$11:$C$109,B65)","v":0},{"$f":"SUMIFS(iTABUF!$K$11:$K$109,iTABUF!$C$11:$C$109,B65)","v":0},{"$f":"SUMIFS(iTABUF!$L$11:$L$109,iTABUF!$C$11:$C$109,B65)","v":0},{"$f":"SUMIFS(iTABUF!$M$11:$M$109,iTABUF!$C$11:$C$109,B65)","v":0},{"$f":"iUI!I65","v":0},{"$f":"iUI!J65","v":0},{"$f":"iUI!L65","v":0}]
[null,"U56",null,{"$f":"IF(iUI!D66<>\"\",iUI!D66,\"\")","v":""},{"$f":"IF(iUI!F66<>\"\",iUI!F66,\"\")","v":""},{"$f":"SUMIFS(iTABUF!$D$11:$D$109,iTABUF!$C$11:$C$109,B66)","v":0},{"$f":"SUMIFS(iTABUF!$E$11:$E$109,iTABUF!$C$11:$C$109,B66)","v":0},{"$f":"SUMIFS(iTABUF!$F$11:$F$109,iTABUF!$C$11:$C$109,B66)","v":0},{"$f":"SUMIFS(iTABUF!$G$11:$G$109,iTABUF!$C$11:$C$109,B66)","v":0},{"$f":"SUMIFS(iTABUF!$H$11:$H$109,iTABUF!$C$11:$C$109,B66)","v":0},{"$f":"SUMIFS(iTABUF!$I$11:$I$109,iTABUF!$C$11:$C$109,B66)","v":0},{"$f":"SUMIFS(iTABUF!$J$11:$J$109,iTABUF!$C$11:$C$109,B66)","v":0},{"$f":"SUMIFS(iTABUF!$K$11:$K$109,iTABUF!$C$11:$C$109,B66)","v":0},{"$f":"SUMIFS(iTABUF!$L$11:$L$109,iTABUF!$C$11:$C$109,B66)","v":0},{"$f":"SUMIFS(iTABUF!$M$11:$M$109,iTABUF!$C$11:$C$109,B66)","v":0},{"$f":"iUI!I66","v":0},{"$f":"iUI!J66","v":0},{"$f":"iUI!L66","v":0}]
[null,"U57",null,{"$f":"IF(iUI!D67<>\"\",iUI!D67,\"\")","v":""},{"$f":"IF(iUI!F67<>\"\",iUI!F67,\"\")","v":""},{"$f":"SUMIFS(iTABUF!$D$11:$D$109,iTABUF!$C$11:$C$109,B67)","v":0},{"$f":"SUMIFS(iTABUF!$E$11:$E$109,iTABUF!$C$11:$C$109,B67)","v":0},{"$f":"SUMIFS(iTABUF!$F$11:$F$109,iTABUF!$C$11:$C$109,B67)","v":0},{"$f":"SUMIFS(iTABUF!$G$11:$G$109,iTABUF!$C$11:$C$109,B67)","v":0},{"$f":"SUMIFS(iTABUF!$H$11:$H$109,iTABUF!$C$11:$C$109,B67)","v":0},{"$f":"SUMIFS(iTABUF!$I$11:$I$109,iTABUF!$C$11:$C$109,B67)","v":0},{"$f":"SUMIFS(iTABUF!$J$11:$J$109,iTABUF!$C$11:$C$109,B67)","v":0},{"$f":"SUMIFS(iTABUF!$K$11:$K$109,iTABUF!$C$11:$C$109,B67)","v":0},{"$f":"SUMIFS(iTABUF!$L$11:$L$109,iTABUF!$C$11:$C$109,B67)","v":0},{"$f":"SUMIFS(iTABUF!$M$11:$M$109,iTABUF!$C$11:$C$109,B67)","v":0},{"$f":"iUI!I67","v":0},{"$f":"iUI!J67","v":0},{"$f":"iUI!L67","v":0}]
[null,"U58",null,{"$f":"IF(iUI!D68<>\"\",iUI!D68,\"\")","v":""},{"$f":"IF(iUI!F68<>\"\",iUI!F68,\"\")","v":""},{"$f":"SUMIFS(iTABUF!$D$11:$D$109,iTABUF!$C$11:$C$109,B68)","v":0},{"$f":"SUMIFS(iTABUF!$E$11:$E$109,iTABUF!$C$11:$C$109,B68)","v":0},{"$f":"SUMIFS(iTABUF!$F$11:$F$109,iTABUF!$C$11:$C$109,B68)","v":0},{"$f":"SUMIFS(iTABUF!$G$11:$G$109,iTABUF!$C$11:$C$109,B68)","v":0},{"$f":"SUMIFS(iTABUF!$H$11:$H$109,iTABUF!$C$11:$C$109,B68)","v":0},{"$f":"SUMIFS(iTABUF!$I$11:$I$109,iTABUF!$C$11:$C$109,B68)","v":0},{"$f":"SUMIFS(iTABUF!$J$11:$J$109,iTABUF!$C$11:$C$109,B68)","v":0},{"$f":"SUMIFS(iTABUF!$K$11:$K$109,iTABUF!$C$11:$C$109,B68)","v":0},{"$f":"SUMIFS(iTABUF!$L$11:$L$109,iTABUF!$C$11:$C$109,B68)","v":0},{"$f":"SUMIFS(iTABUF!$M$11:$M$109,iTABUF!$C$11:$C$109,B68)","v":0},{"$f":"iUI!I68","v":0},{"$f":"iUI!J68","v":0},{"$f":"iUI!L68","v":0}]
[null,"U59",null,{"$f":"IF(iUI!D69<>\"\",iUI!D69,\"\")","v":""},{"$f":"IF(iUI!F69<>\"\",iUI!F69,\"\")","v":""},{"$f":"SUMIFS(iTABUF!$D$11:$D$109,iTABUF!$C$11:$C$109,B69)","v":0},{"$f":"SUMIFS(iTABUF!$E$11:$E$109,iTABUF!$C$11:$C$109,B69)","v":0},{"$f":"SUMIFS(iTABUF!$F$11:$F$109,iTABUF!$C$11:$C$109,B69)","v":0},{"$f":"SUMIFS(iTABUF!$G$11:$G$109,iTABUF!$C$11:$C$109,B69)","v":0},{"$f":"SUMIFS(iTABUF!$H$11:$H$109,iTABUF!$C$11:$C$109,B69)","v":0},{"$f":"SUMIFS(iTABUF!$I$11:$I$109,iTABUF!$C$11:$C$109,B69)","v":0},{"$f":"SUMIFS(iTABUF!$J$11:$J$109,iTABUF!$C$11:$C$109,B69)","v":0},{"$f":"SUMIFS(iTABUF!$K$11:$K$109,iTABUF!$C$11:$C$109,B69)","v":0},{"$f":"SUMIFS(iTABUF!$L$11:$L$109,iTABUF!$C$11:$C$109,B69)","v":0},{"$f":"SUMIFS(iTABUF!$M$11:$M$109,iTABUF!$C$11:$C$109,B69)","v":0},{"$f":"iUI!I69","v":0},{"$f":"iUI!J69","v":0},{"$f":"iUI!L69","v":0}]
[null,"U60",null,{"$f":"IF(iUI!D70<>\"\",iUI!D70,\"\")","v":""},{"$f":"IF(iUI!F70<>\"\",iUI!F70,\"\")","v":""},{"$f":"SUMIFS(iTABUF!$D$11:$D$109,iTABUF!$C$11:$C$109,B70)","v":0},{"$f":"SUMIFS(iTABUF!$E$11:$E$109,iTABUF!$C$11:$C$109,B70)","v":0},{"$f":"SUMIFS(iTABUF!$F$11:$F$109,iTABUF!$C$11:$C$109,B70)","v":0},{"$f":"SUMIFS(iTABUF!$G$11:$G$109,iTABUF!$C$11:$C$109,B70)","v":0},{"$f":"SUMIFS(iTABUF!$H$11:$H$109,iTABUF!$C$11:$C$109,B70)","v":0},{"$f":"SUMIFS(iTABUF!$I$11:$I$109,iTABUF!$C$11:$C$109,B70)","v":0},{"$f":"SUMIFS(iTABUF!$J$11:$J$109,iTABUF!$C$11:$C$109,B70)","v":0},{"$f":"SUMIFS(iTABUF!$K$11:$K$109,iTABUF!$C$11:$C$109,B70)","v":0},{"$f":"SUMIFS(iTABUF!$L$11:$L$109,iTABUF!$C$11:$C$109,B70)","v":0},{"$f":"SUMIFS(iTABUF!$M$11:$M$109,iTABUF!$C$11:$C$109,B70)","v":0},{"$f":"iUI!I70","v":0},{"$f":"iUI!J70","v":0},{"$f":"iUI!L70","v":0}]
[null,"U61",null,{"$f":"IF(iUI!D71<>\"\",iUI!D71,\"\")","v":""},{"$f":"IF(iUI!F71<>\"\",iUI!F71,\"\")","v":""},{"$f":"SUMIFS(iTABUF!$D$11:$D$109,iTABUF!$C$11:$C$109,B71)","v":0},{"$f":"SUMIFS(iTABUF!$E$11:$E$109,iTABUF!$C$11:$C$109,B71)","v":0},{"$f":"SUMIFS(iTABUF!$F$11:$F$109,iTABUF!$C$11:$C$109,B71)","v":0},{"$f":"SUMIFS(iTABUF!$G$11:$G$109,iTABUF!$C$11:$C$109,B71)","v":0},{"$f":"SUMIFS(iTABUF!$H$11:$H$109,iTABUF!$C$11:$C$109,B71)","v":0},{"$f":"SUMIFS(iTABUF!$I$11:$I$109,iTABUF!$C$11:$C$109,B71)","v":0},{"$f":"SUMIFS(iTABUF!$J$11:$J$109,iTABUF!$C$11:$C$109,B71)","v":0},{"$f":"SUMIFS(iTABUF!$K$11:$K$109,iTABUF!$C$11:$C$109,B71)","v":0},{"$f":"SUMIFS(iTABUF!$L$11:$L$109,iTABUF!$C$11:$C$109,B71)","v":0},{"$f":"SUMIFS(iTABUF!$M$11:$M$109,iTABUF!$C$11:$C$109,B71)","v":0},{"$f":"iUI!I71","v":0},{"$f":"iUI!J71","v":0},{"$f":"iUI!L71","v":0}]
[null,"U62",null,{"$f":"IF(iUI!D72<>\"\",iUI!D72,\"\")","v":""},{"$f":"IF(iUI!F72<>\"\",iUI!F72,\"\")","v":""},{"$f":"SUMIFS(iTABUF!$D$11:$D$109,iTABUF!$C$11:$C$109,B72)","v":0},{"$f":"SUMIFS(iTABUF!$E$11:$E$109,iTABUF!$C$11:$C$109,B72)","v":0},{"$f":"SUMIFS(iTABUF!$F$11:$F$109,iTABUF!$C$11:$C$109,B72)","v":0},{"$f":"SUMIFS(iTABUF!$G$11:$G$109,iTABUF!$C$11:$C$109,B72)","v":0},{"$f":"SUMIFS(iTABUF!$H$11:$H$109,iTABUF!$C$11:$C$109,B72)","v":0},{"$f":"SUMIFS(iTABUF!$I$11:$I$109,iTABUF!$C$11:$C$109,B72)","v":0},{"$f":"SUMIFS(iTABUF!$J$11:$J$109,iTABUF!$C$11:$C$109,B72)","v":0},{"$f":"SUMIFS(iTABUF!$K$11:$K$109,iTABUF!$C$11:$C$109,B72)","v":0},{"$f":"SUMIFS(iTABUF!$L$11:$L$109,iTABUF!$C$11:$C$109,B72)","v":0},{"$f":"SUMIFS(iTABUF!$M$11:$M$109,iTABUF!$C$11:$C$109,B72)","v":0},{"$f":"iUI!I72","v":0},{"$f":"iUI!J72","v":0},{"$f":"iUI!L72","v":0}]
[null,"U63",null,{"$f":"IF(iUI!D73<>\"\",iUI!D73,\"\")","v":""},{"$f":"IF(iUI!F73<>\"\",iUI!F73,\"\")","v":""},{"$f":"SUMIFS(iTABUF!$D$11:$D$109,iTABUF!$C$11:$C$109,B73)","v":0},{"$f":"SUMIFS(iTABUF!$E$11:$E$109,iTABUF!$C$11:$C$109,B73)","v":0},{"$f":"SUMIFS(iTABUF!$F$11:$F$109,iTABUF!$C$11:$C$109,B73)","v":0},{"$f":"SUMIFS(iTABUF!$G$11:$G$109,iTABUF!$C$11:$C$109,B73)","v":0},{"$f":"SUMIFS(iTABUF!$H$11:$H$109,iTABUF!$C$11:$C$109,B73)","v":0},{"$f":"SUMIFS(iTABUF!$I$11:$I$109,iTABUF!$C$11:$C$109,B73)","v":0},{"$f":"SUMIFS(iTABUF!$J$11:$J$109,iTABUF!$C$11:$C$109,B73)","v":0},{"$f":"SUMIFS(iTABUF!$K$11:$K$109,iTABUF!$C$11:$C$109,B73)","v":0},{"$f":"SUMIFS(iTABUF!$L$11:$L$109,iTABUF!$C$11:$C$109,B73)","v":0},{"$f":"SUMIFS(iTABUF!$M$11:$M$109,iTABUF!$C$11:$C$109,B73)","v":0},{"$f":"iUI!I73","v":0},{"$f":"iUI!J73","v":0},{"$f":"iUI!L73","v":0}]
[null,"U64",null,{"$f":"IF(iUI!D74<>\"\",iUI!D74,\"\")","v":""},{"$f":"IF(iUI!F74<>\"\",iUI!F74,\"\")","v":""},{"$f":"SUMIFS(iTABUF!$D$11:$D$109,iTABUF!$C$11:$C$109,B74)","v":0},{"$f":"SUMIFS(iTABUF!$E$11:$E$109,iTABUF!$C$11:$C$109,B74)","v":0},{"$f":"SUMIFS(iTABUF!$F$11:$F$109,iTABUF!$C$11:$C$109,B74)","v":0},{"$f":"SUMIFS(iTABUF!$G$11:$G$109,iTABUF!$C$11:$C$109,B74)","v":0},{"$f":"SUMIFS(iTABUF!$H$11:$H$109,iTABUF!$C$11:$C$109,B74)","v":0},{"$f":"SUMIFS(iTABUF!$I$11:$I$109,iTABUF!$C$11:$C$109,B74)","v":0},{"$f":"SUMIFS(iTABUF!$J$11:$J$109,iTABUF!$C$11:$C$109,B74)","v":0},{"$f":"SUMIFS(iTABUF!$K$11:$K$109,iTABUF!$C$11:$C$109,B74)","v":0},{"$f":"SUMIFS(iTABUF!$L$11:$L$109,iTABUF!$C$11:$C$109,B74)","v":0},{"$f":"SUMIFS(iTABUF!$M$11:$M$109,iTABUF!$C$11:$C$109,B74)","v":0},{"$f":"iUI!I74","v":0},{"$f":"iUI!J74","v":0},{"$f":"iUI!L74","v":0}]
[null,"U65",null,{"$f":"IF(iUI!D75<>\"\",iUI!D75,\"\")","v":""},{"$f":"IF(iUI!F75<>\"\",iUI!F75,\"\")","v":""},{"$f":"SUMIFS(iTABUF!$D$11:$D$109,iTABUF!$C$11:$C$109,B75)","v":0},{"$f":"SUMIFS(iTABUF!$E$11:$E$109,iTABUF!$C$11:$C$109,B75)","v":0},{"$f":"SUMIFS(iTABUF!$F$11:$F$109,iTABUF!$C$11:$C$109,B75)","v":0},{"$f":"SUMIFS(iTABUF!$G$11:$G$109,iTABUF!$C$11:$C$109,B75)","v":0},{"$f":"SUMIFS(iTABUF!$H$11:$H$109,iTABUF!$C$11:$C$109,B75)","v":0},{"$f":"SUMIFS(iTABUF!$I$11:$I$109,iTABUF!$C$11:$C$109,B75)","v":0},{"$f":"SUMIFS(iTABUF!$J$11:$J$109,iTABUF!$C$11:$C$109,B75)","v":0},{"$f":"SUMIFS(iTABUF!$K$11:$K$109,iTABUF!$C$11:$C$109,B75)","v":0},{"$f":"SUMIFS(iTABUF!$L$11:$L$109,iTABUF!$C$11:$C$109,B75)","v":0},{"$f":"SUMIFS(iTABUF!$M$11:$M$109,iTABUF!$C$11:$C$109,B75)","v":0},{"$f":"iUI!I75","v":0},{"$f":"iUI!J75","v":0},{"$f":"iUI!L75","v":0}]
[null,"U66",null,{"$f":"IF(iUI!D76<>\"\",iUI!D76,\"\")","v":""},{"$f":"IF(iUI!F76<>\"\",iUI!F76,\"\")","v":""},{"$f":"SUMIFS(iTABUF!$D$11:$D$109,iTABUF!$C$11:$C$109,B76)","v":0},{"$f":"SUMIFS(iTABUF!$E$11:$E$109,iTABUF!$C$11:$C$109,B76)","v":0},{"$f":"SUMIFS(iTABUF!$F$11:$F$109,iTABUF!$C$11:$C$109,B76)","v":0},{"$f":"SUMIFS(iTABUF!$G$11:$G$109,iTABUF!$C$11:$C$109,B76)","v":0},{"$f":"SUMIFS(iTABUF!$H$11:$H$109,iTABUF!$C$11:$C$109,B76)","v":0},{"$f":"SUMIFS(iTABUF!$I$11:$I$109,iTABUF!$C$11:$C$109,B76)","v":0},{"$f":"SUMIFS(iTABUF!$J$11:$J$109,iTABUF!$C$11:$C$109,B76)","v":0},{"$f":"SUMIFS(iTABUF!$K$11:$K$109,iTABUF!$C$11:$C$109,B76)","v":0},{"$f":"SUMIFS(iTABUF!$L$11:$L$109,iTABUF!$C$11:$C$109,B76)","v":0},{"$f":"SUMIFS(iTABUF!$M$11:$M$109,iTABUF!$C$11:$C$109,B76)","v":0},{"$f":"iUI!I76","v":0},{"$f":"iUI!J76","v":0},{"$f":"iUI!L76","v":0}]
[null,"U67",null,{"$f":"IF(iUI!D77<>\"\",iUI!D77,\"\")","v":""},{"$f":"IF(iUI!F77<>\"\",iUI!F77,\"\")","v":""},{"$f":"SUMIFS(iTABUF!$D$11:$D$109,iTABUF!$C$11:$C$109,B77)","v":0},{"$f":"SUMIFS(iTABUF!$E$11:$E$109,iTABUF!$C$11:$C$109,B77)","v":0},{"$f":"SUMIFS(iTABUF!$F$11:$F$109,iTABUF!$C$11:$C$109,B77)","v":0},{"$f":"SUMIFS(iTABUF!$G$11:$G$109,iTABUF!$C$11:$C$109,B77)","v":0},{"$f":"SUMIFS(iTABUF!$H$11:$H$109,iTABUF!$C$11:$C$109,B77)","v":0},{"$f":"SUMIFS(iTABUF!$I$11:$I$109,iTABUF!$C$11:$C$109,B77)","v":0},{"$f":"SUMIFS(iTABUF!$J$11:$J$109,iTABUF!$C$11:$C$109,B77)","v":0},{"$f":"SUMIFS(iTABUF!$K$11:$K$109,iTABUF!$C$11:$C$109,B77)","v":0},{"$f":"SUMIFS(iTABUF!$L$11:$L$109,iTABUF!$C$11:$C$109,B77)","v":0},{"$f":"SUMIFS(iTABUF!$M$11:$M$109,iTABUF!$C$11:$C$109,B77)","v":0},{"$f":"iUI!I77","v":0},{"$f":"iUI!J77","v":0},{"$f":"iUI!L77","v":0}]
[null,"U68",null,{"$f":"IF(iUI!D78<>\"\",iUI!D78,\"\")","v":""},{"$f":"IF(iUI!F78<>\"\",iUI!F78,\"\")","v":""},{"$f":"SUMIFS(iTABUF!$D$11:$D$109,iTABUF!$C$11:$C$109,B78)","v":0},{"$f":"SUMIFS(iTABUF!$E$11:$E$109,iTABUF!$C$11:$C$109,B78)","v":0},{"$f":"SUMIFS(iTABUF!$F$11:$F$109,iTABUF!$C$11:$C$109,B78)","v":0},{"$f":"SUMIFS(iTABUF!$G$11:$G$109,iTABUF!$C$11:$C$109,B78)","v":0},{"$f":"SUMIFS(iTABUF!$H$11:$H$109,iTABUF!$C$11:$C$109,B78)","v":0},{"$f":"SUMIFS(iTABUF!$I$11:$I$109,iTABUF!$C$11:$C$109,B78)","v":0},{"$f":"SUMIFS(iTABUF!$J$11:$J$109,iTABUF!$C$11:$C$109,B78)","v":0},{"$f":"SUMIFS(iTABUF!$K$11:$K$109,iTABUF!$C$11:$C$109,B78)","v":0},{"$f":"SUMIFS(iTABUF!$L$11:$L$109,iTABUF!$C$11:$C$109,B78)","v":0},{"$f":"SUMIFS(iTABUF!$M$11:$M$109,iTABUF!$C$11:$C$109,B78)","v":0},{"$f":"iUI!I78","v":0},{"$f":"iUI!J78","v":0},{"$f":"iUI!L78","v":0}]
[null,"U69",null,{"$f":"IF(iUI!D79<>\"\",iUI!D79,\"\")","v":""},{"$f":"IF(iUI!F79<>\"\",iUI!F79,\"\")","v":""},{"$f":"SUMIFS(iTABUF!$D$11:$D$109,iTABUF!$C$11:$C$109,B79)","v":0},{"$f":"SUMIFS(iTABUF!$E$11:$E$109,iTABUF!$C$11:$C$109,B79)","v":0},{"$f":"SUMIFS(iTABUF!$F$11:$F$109,iTABUF!$C$11:$C$109,B79)","v":0},{"$f":"SUMIFS(iTABUF!$G$11:$G$109,iTABUF!$C$11:$C$109,B79)","v":0},{"$f":"SUMIFS(iTABUF!$H$11:$H$109,iTABUF!$C$11:$C$109,B79)","v":0},{"$f":"SUMIFS(iTABUF!$I$11:$I$109,iTABUF!$C$11:$C$109,B79)","v":0},{"$f":"SUMIFS(iTABUF!$J$11:$J$109,iTABUF!$C$11:$C$109,B79)","v":0},{"$f":"SUMIFS(iTABUF!$K$11:$K$109,iTABUF!$C$11:$C$109,B79)","v":0},{"$f":"SUMIFS(iTABUF!$L$11:$L$109,iTABUF!$C$11:$C$109,B79)","v":0},{"$f":"SUMIFS(iTABUF!$M$11:$M$109,iTABUF!$C$11:$C$109,B79)","v":0},{"$f":"iUI!I79","v":0},{"$f":"iUI!J79","v":0},{"$f":"iUI!L79","v":0}]
[null,"U70",null,{"$f":"IF(iUI!D80<>\"\",iUI!D80,\"\")","v":""},{"$f":"IF(iUI!F80<>\"\",iUI!F80,\"\")","v":""},{"$f":"SUMIFS(iTABUF!$D$11:$D$109,iTABUF!$C$11:$C$109,B80)","v":0},{"$f":"SUMIFS(iTABUF!$E$11:$E$109,iTABUF!$C$11:$C$109,B80)","v":0},{"$f":"SUMIFS(iTABUF!$F$11:$F$109,iTABUF!$C$11:$C$109,B80)","v":0},{"$f":"SUMIFS(iTABUF!$G$11:$G$109,iTABUF!$C$11:$C$109,B80)","v":0},{"$f":"SUMIFS(iTABUF!$H$11:$H$109,iTABUF!$C$11:$C$109,B80)","v":0},{"$f":"SUMIFS(iTABUF!$I$11:$I$109,iTABUF!$C$11:$C$109,B80)","v":0},{"$f":"SUMIFS(iTABUF!$J$11:$J$109,iTABUF!$C$11:$C$109,B80)","v":0},{"$f":"SUMIFS(iTABUF!$K$11:$K$109,iTABUF!$C$11:$C$109,B80)","v":0},{"$f":"SUMIFS(iTABUF!$L$11:$L$109,iTABUF!$C$11:$C$109,B80)","v":0},{"$f":"SUMIFS(iTABUF!$M$11:$M$109,iTABUF!$C$11:$C$109,B80)","v":0},{"$f":"iUI!I80","v":0},{"$f":"iUI!J80","v":0},{"$f":"iUI!L80","v":0}]
[null,"U71",null,{"$f":"IF(iUI!D81<>\"\",iUI!D81,\"\")","v":""},{"$f":"IF(iUI!F81<>\"\",iUI!F81,\"\")","v":""},{"$f":"SUMIFS(iTABUF!$D$11:$D$109,iTABUF!$C$11:$C$109,B81)","v":0},{"$f":"SUMIFS(iTABUF!$E$11:$E$109,iTABUF!$C$11:$C$109,B81)","v":0},{"$f":"SUMIFS(iTABUF!$F$11:$F$109,iTABUF!$C$11:$C$109,B81)","v":0},{"$f":"SUMIFS(iTABUF!$G$11:$G$109,iTABUF!$C$11:$C$109,B81)","v":0},{"$f":"SUMIFS(iTABUF!$H$11:$H$109,iTABUF!$C$11:$C$109,B81)","v":0},{"$f":"SUMIFS(iTABUF!$I$11:$I$109,iTABUF!$C$11:$C$109,B81)","v":0},{"$f":"SUMIFS(iTABUF!$J$11:$J$109,iTABUF!$C$11:$C$109,B81)","v":0},{"$f":"SUMIFS(iTABUF!$K$11:$K$109,iTABUF!$C$11:$C$109,B81)","v":0},{"$f":"SUMIFS(iTABUF!$L$11:$L$109,iTABUF!$C$11:$C$109,B81)","v":0},{"$f":"SUMIFS(iTABUF!$M$11:$M$109,iTABUF!$C$11:$C$109,B81)","v":0},{"$f":"iUI!I81","v":0},{"$f":"iUI!J81","v":0},{"$f":"iUI!L81","v":0}]
[null,"U72",null,{"$f":"IF(iUI!D82<>\"\",iUI!D82,\"\")","v":""},{"$f":"IF(iUI!F82<>\"\",iUI!F82,\"\")","v":""},{"$f":"SUMIFS(iTABUF!$D$11:$D$109,iTABUF!$C$11:$C$109,B82)","v":0},{"$f":"SUMIFS(iTABUF!$E$11:$E$109,iTABUF!$C$11:$C$109,B82)","v":0},{"$f":"SUMIFS(iTABUF!$F$11:$F$109,iTABUF!$C$11:$C$109,B82)","v":0},{"$f":"SUMIFS(iTABUF!$G$11:$G$109,iTABUF!$C$11:$C$109,B82)","v":0},{"$f":"SUMIFS(iTABUF!$H$11:$H$109,iTABUF!$C$11:$C$109,B82)","v":0},{"$f":"SUMIFS(iTABUF!$I$11:$I$109,iTABUF!$C$11:$C$109,B82)","v":0},{"$f":"SUMIFS(iTABUF!$J$11:$J$109,iTABUF!$C$11:$C$109,B82)","v":0},{"$f":"SUMIFS(iTABUF!$K$11:$K$109,iTABUF!$C$11:$C$109,B82)","v":0},{"$f":"SUMIFS(iTABUF!$L$11:$L$109,iTABUF!$C$11:$C$109,B82)","v":0},{"$f":"SUMIFS(iTABUF!$M$11:$M$109,iTABUF!$C$11:$C$109,B82)","v":0},{"$f":"iUI!I82","v":0},{"$f":"iUI!J82","v":0},{"$f":"iUI!L82","v":0}]
[null,"U73",null,{"$f":"IF(iUI!D83<>\"\",iUI!D83,\"\")","v":""},{"$f":"IF(iUI!F83<>\"\",iUI!F83,\"\")","v":""},{"$f":"SUMIFS(iTABUF!$D$11:$D$109,iTABUF!$C$11:$C$109,B83)","v":0},{"$f":"SUMIFS(iTABUF!$E$11:$E$109,iTABUF!$C$11:$C$109,B83)","v":0},{"$f":"SUMIFS(iTABUF!$F$11:$F$109,iTABUF!$C$11:$C$109,B83)","v":0},{"$f":"SUMIFS(iTABUF!$G$11:$G$109,iTABUF!$C$11:$C$109,B83)","v":0},{"$f":"SUMIFS(iTABUF!$H$11:$H$109,iTABUF!$C$11:$C$109,B83)","v":0},{"$f":"SUMIFS(iTABUF!$I$11:$I$109,iTABUF!$C$11:$C$109,B83)","v":0},{"$f":"SUMIFS(iTABUF!$J$11:$J$109,iTABUF!$C$11:$C$109,B83)","v":0},{"$f":"SUMIFS(iTABUF!$K$11:$K$109,iTABUF!$C$11:$C$109,B83)","v":0},{"$f":"SUMIFS(iTABUF!$L$11:$L$109,iTABUF!$C$11:$C$109,B83)","v":0},{"$f":"SUMIFS(iTABUF!$M$11:$M$109,iTABUF!$C$11:$C$109,B83)","v":0},{"$f":"iUI!I83","v":0},{"$f":"iUI!J83","v":0},{"$f":"iUI!L83","v":0}]
[null,"U74",null,{"$f":"IF(iUI!D84<>\"\",iUI!D84,\"\")","v":""},{"$f":"IF(iUI!F84<>\"\",iUI!F84,\"\")","v":""},{"$f":"SUMIFS(iTABUF!$D$11:$D$109,iTABUF!$C$11:$C$109,B84)","v":0},{"$f":"SUMIFS(iTABUF!$E$11:$E$109,iTABUF!$C$11:$C$109,B84)","v":0},{"$f":"SUMIFS(iTABUF!$F$11:$F$109,iTABUF!$C$11:$C$109,B84)","v":0},{"$f":"SUMIFS(iTABUF!$G$11:$G$109,iTABUF!$C$11:$C$109,B84)","v":0},{"$f":"SUMIFS(iTABUF!$H$11:$H$109,iTABUF!$C$11:$C$109,B84)","v":0},{"$f":"SUMIFS(iTABUF!$I$11:$I$109,iTABUF!$C$11:$C$109,B84)","v":0},{"$f":"SUMIFS(iTABUF!$J$11:$J$109,iTABUF!$C$11:$C$109,B84)","v":0},{"$f":"SUMIFS(iTABUF!$K$11:$K$109,iTABUF!$C$11:$C$109,B84)","v":0},{"$f":"SUMIFS(iTABUF!$L$11:$L$109,iTABUF!$C$11:$C$109,B84)","v":0},{"$f":"SUMIFS(iTABUF!$M$11:$M$109,iTABUF!$C$11:$C$109,B84)","v":0},{"$f":"iUI!I84","v":0},{"$f":"iUI!J84","v":0},{"$f":"iUI!L84","v":0}]
[null,"U75",null,{"$f":"IF(iUI!D85<>\"\",iUI!D85,\"\")","v":""},{"$f":"IF(iUI!F85<>\"\",iUI!F85,\"\")","v":""},{"$f":"SUMIFS(iTABUF!$D$11:$D$109,iTABUF!$C$11:$C$109,B85)","v":0},{"$f":"SUMIFS(iTABUF!$E$11:$E$109,iTABUF!$C$11:$C$109,B85)","v":0},{"$f":"SUMIFS(iTABUF!$F$11:$F$109,iTABUF!$C$11:$C$109,B85)","v":0},{"$f":"SUMIFS(iTABUF!$G$11:$G$109,iTABUF!$C$11:$C$109,B85)","v":0},{"$f":"SUMIFS(iTABUF!$H$11:$H$109,iTABUF!$C$11:$C$109,B85)","v":0},{"$f":"SUMIFS(iTABUF!$I$11:$I$109,iTABUF!$C$11:$C$109,B85)","v":0},{"$f":"SUMIFS(iTABUF!$J$11:$J$109,iTABUF!$C$11:$C$109,B85)","v":0},{"$f":"SUMIFS(iTABUF!$K$11:$K$109,iTABUF!$C$11:$C$109,B85)","v":0},{"$f":"SUMIFS(iTABUF!$L$11:$L$109,iTABUF!$C$11:$C$109,B85)","v":0},{"$f":"SUMIFS(iTABUF!$M$11:$M$109,iTABUF!$C$11:$C$109,B85)","v":0},{"$f":"iUI!I85","v":0},{"$f":"iUI!J85","v":0},{"$f":"iUI!L85","v":0}]
[null,"U76",null,{"$f":"IF(iUI!D86<>\"\",iUI!D86,\"\")","v":""},{"$f":"IF(iUI!F86<>\"\",iUI!F86,\"\")","v":""},{"$f":"SUMIFS(iTABUF!$D$11:$D$109,iTABUF!$C$11:$C$109,B86)","v":0},{"$f":"SUMIFS(iTABUF!$E$11:$E$109,iTABUF!$C$11:$C$109,B86)","v":0},{"$f":"SUMIFS(iTABUF!$F$11:$F$109,iTABUF!$C$11:$C$109,B86)","v":0},{"$f":"SUMIFS(iTABUF!$G$11:$G$109,iTABUF!$C$11:$C$109,B86)","v":0},{"$f":"SUMIFS(iTABUF!$H$11:$H$109,iTABUF!$C$11:$C$109,B86)","v":0},{"$f":"SUMIFS(iTABUF!$I$11:$I$109,iTABUF!$C$11:$C$109,B86)","v":0},{"$f":"SUMIFS(iTABUF!$J$11:$J$109,iTABUF!$C$11:$C$109,B86)","v":0},{"$f":"SUMIFS(iTABUF!$K$11:$K$109,iTABUF!$C$11:$C$109,B86)","v":0},{"$f":"SUMIFS(iTABUF!$L$11:$L$109,iTABUF!$C$11:$C$109,B86)","v":0},{"$f":"SUMIFS(iTABUF!$M$11:$M$109,iTABUF!$C$11:$C$109,B86)","v":0},{"$f":"iUI!I86","v":0},{"$f":"iUI!J86","v":0},{"$f":"iUI!L86","v":0}]
[null,"U77",null,{"$f":"IF(iUI!D87<>\"\",iUI!D87,\"\")","v":""},{"$f":"IF(iUI!F87<>\"\",iUI!F87,\"\")","v":""},{"$f":"SUMIFS(iTABUF!$D$11:$D$109,iTABUF!$C$11:$C$109,B87)","v":0},{"$f":"SUMIFS(iTABUF!$E$11:$E$109,iTABUF!$C$11:$C$109,B87)","v":0},{"$f":"SUMIFS(iTABUF!$F$11:$F$109,iTABUF!$C$11:$C$109,B87)","v":0},{"$f":"SUMIFS(iTABUF!$G$11:$G$109,iTABUF!$C$11:$C$109,B87)","v":0},{"$f":"SUMIFS(iTABUF!$H$11:$H$109,iTABUF!$C$11:$C$109,B87)","v":0},{"$f":"SUMIFS(iTABUF!$I$11:$I$109,iTABUF!$C$11:$C$109,B87)","v":0},{"$f":"SUMIFS(iTABUF!$J$11:$J$109,iTABUF!$C$11:$C$109,B87)","v":0},{"$f":"SUMIFS(iTABUF!$K$11:$K$109,iTABUF!$C$11:$C$109,B87)","v":0},{"$f":"SUMIFS(iTABUF!$L$11:$L$109,iTABUF!$C$11:$C$109,B87)","v":0},{"$f":"SUMIFS(iTABUF!$M$11:$M$109,iTABUF!$C$11:$C$109,B87)","v":0},{"$f":"iUI!I87","v":0},{"$f":"iUI!J87","v":0},{"$f":"iUI!L87","v":0}]
[null,"U78",null,{"$f":"IF(iUI!D88<>\"\",iUI!D88,\"\")","v":""},{"$f":"IF(iUI!F88<>\"\",iUI!F88,\"\")","v":""},{"$f":"SUMIFS(iTABUF!$D$11:$D$109,iTABUF!$C$11:$C$109,B88)","v":0},{"$f":"SUMIFS(iTABUF!$E$11:$E$109,iTABUF!$C$11:$C$109,B88)","v":0},{"$f":"SUMIFS(iTABUF!$F$11:$F$109,iTABUF!$C$11:$C$109,B88)","v":0},{"$f":"SUMIFS(iTABUF!$G$11:$G$109,iTABUF!$C$11:$C$109,B88)","v":0},{"$f":"SUMIFS(iTABUF!$H$11:$H$109,iTABUF!$C$11:$C$109,B88)","v":0},{"$f":"SUMIFS(iTABUF!$I$11:$I$109,iTABUF!$C$11:$C$109,B88)","v":0},{"$f":"SUMIFS(iTABUF!$J$11:$J$109,iTABUF!$C$11:$C$109,B88)","v":0},{"$f":"SUMIFS(iTABUF!$K$11:$K$109,iTABUF!$C$11:$C$109,B88)","v":0},{"$f":"SUMIFS(iTABUF!$L$11:$L$109,iTABUF!$C$11:$C$109,B88)","v":0},{"$f":"SUMIFS(iTABUF!$M$11:$M$109,iTABUF!$C$11:$C$109,B88)","v":0},{"$f":"iUI!I88","v":0},{"$f":"iUI!J88","v":0},{"$f":"iUI!L88","v":0}]
[null,"U79",null,{"$f":"IF(iUI!D89<>\"\",iUI!D89,\"\")","v":""},{"$f":"IF(iUI!F89<>\"\",iUI!F89,\"\")","v":""},{"$f":"SUMIFS(iTABUF!$D$11:$D$109,iTABUF!$C$11:$C$109,B89)","v":0},{"$f":"SUMIFS(iTABUF!$E$11:$E$109,iTABUF!$C$11:$C$109,B89)","v":0},{"$f":"SUMIFS(iTABUF!$F$11:$F$109,iTABUF!$C$11:$C$109,B89)","v":0},{"$f":"SUMIFS(iTABUF!$G$11:$G$109,iTABUF!$C$11:$C$109,B89)","v":0},{"$f":"SUMIFS(iTABUF!$H$11:$H$109,iTABUF!$C$11:$C$109,B89)","v":0},{"$f":"SUMIFS(iTABUF!$I$11:$I$109,iTABUF!$C$11:$C$109,B89)","v":0},{"$f":"SUMIFS(iTABUF!$J$11:$J$109,iTABUF!$C$11:$C$109,B89)","v":0},{"$f":"SUMIFS(iTABUF!$K$11:$K$109,iTABUF!$C$11:$C$109,B89)","v":0},{"$f":"SUMIFS(iTABUF!$L$11:$L$109,iTABUF!$C$11:$C$109,B89)","v":0},{"$f":"SUMIFS(iTABUF!$M$11:$M$109,iTABUF!$C$11:$C$109,B89)","v":0},{"$f":"iUI!I89","v":0},{"$f":"iUI!J89","v":0},{"$f":"iUI!L89","v":0}]
[null,"U80",null,{"$f":"IF(iUI!D90<>\"\",iUI!D90,\"\")","v":""},{"$f":"IF(iUI!F90<>\"\",iUI!F90,\"\")","v":""},{"$f":"SUMIFS(iTABUF!$D$11:$D$109,iTABUF!$C$11:$C$109,B90)","v":0},{"$f":"SUMIFS(iTABUF!$E$11:$E$109,iTABUF!$C$11:$C$109,B90)","v":0},{"$f":"SUMIFS(iTABUF!$F$11:$F$109,iTABUF!$C$11:$C$109,B90)","v":0},{"$f":"SUMIFS(iTABUF!$G$11:$G$109,iTABUF!$C$11:$C$109,B90)","v":0},{"$f":"SUMIFS(iTABUF!$H$11:$H$109,iTABUF!$C$11:$C$109,B90)","v":0},{"$f":"SUMIFS(iTABUF!$I$11:$I$109,iTABUF!$C$11:$C$109,B90)","v":0},{"$f":"SUMIFS(iTABUF!$J$11:$J$109,iTABUF!$C$11:$C$109,B90)","v":0},{"$f":"SUMIFS(iTABUF!$K$11:$K$109,iTABUF!$C$11:$C$109,B90)","v":0},{"$f":"SUMIFS(iTABUF!$L$11:$L$109,iTABUF!$C$11:$C$109,B90)","v":0},{"$f":"SUMIFS(iTABUF!$M$11:$M$109,iTABUF!$C$11:$C$109,B90)","v":0},{"$f":"iUI!I90","v":0},{"$f":"iUI!J90","v":0},{"$f":"iUI!L90","v":0}]
[null,"U81",null,{"$f":"IF(iUI!D91<>\"\",iUI!D91,\"\")","v":""},{"$f":"IF(iUI!F91<>\"\",iUI!F91,\"\")","v":""},{"$f":"SUMIFS(iTABUF!$D$11:$D$109,iTABUF!$C$11:$C$109,B91)","v":0},{"$f":"SUMIFS(iTABUF!$E$11:$E$109,iTABUF!$C$11:$C$109,B91)","v":0},{"$f":"SUMIFS(iTABUF!$F$11:$F$109,iTABUF!$C$11:$C$109,B91)","v":0},{"$f":"SUMIFS(iTABUF!$G$11:$G$109,iTABUF!$C$11:$C$109,B91)","v":0},{"$f":"SUMIFS(iTABUF!$H$11:$H$109,iTABUF!$C$11:$C$109,B91)","v":0},{"$f":"SUMIFS(iTABUF!$I$11:$I$109,iTABUF!$C$11:$C$109,B91)","v":0},{"$f":"SUMIFS(iTABUF!$J$11:$J$109,iTABUF!$C$11:$C$109,B91)","v":0},{"$f":"SUMIFS(iTABUF!$K$11:$K$109,iTABUF!$C$11:$C$109,B91)","v":0},{"$f":"SUMIFS(iTABUF!$L$11:$L$109,iTABUF!$C$11:$C$109,B91)","v":0},{"$f":"SUMIFS(iTABUF!$M$11:$M$109,iTABUF!$C$11:$C$109,B91)","v":0},{"$f":"iUI!I91","v":0},{"$f":"iUI!J91","v":0},{"$f":"iUI!L91","v":0}]
[null,"U82",null,{"$f":"IF(iUI!D92<>\"\",iUI!D92,\"\")","v":""},{"$f":"IF(iUI!F92<>\"\",iUI!F92,\"\")","v":""},{"$f":"SUMIFS(iTABUF!$D$11:$D$109,iTABUF!$C$11:$C$109,B92)","v":0},{"$f":"SUMIFS(iTABUF!$E$11:$E$109,iTABUF!$C$11:$C$109,B92)","v":0},{"$f":"SUMIFS(iTABUF!$F$11:$F$109,iTABUF!$C$11:$C$109,B92)","v":0},{"$f":"SUMIFS(iTABUF!$G$11:$G$109,iTABUF!$C$11:$C$109,B92)","v":0},{"$f":"SUMIFS(iTABUF!$H$11:$H$109,iTABUF!$C$11:$C$109,B92)","v":0},{"$f":"SUMIFS(iTABUF!$I$11:$I$109,iTABUF!$C$11:$C$109,B92)","v":0},{"$f":"SUMIFS(iTABUF!$J$11:$J$109,iTABUF!$C$11:$C$109,B92)","v":0},{"$f":"SUMIFS(iTABUF!$K$11:$K$109,iTABUF!$C$11:$C$109,B92)","v":0},{"$f":"SUMIFS(iTABUF!$L$11:$L$109,iTABUF!$C$11:$C$109,B92)","v":0},{"$f":"SUMIFS(iTABUF!$M$11:$M$109,iTABUF!$C$11:$C$109,B92)","v":0},{"$f":"iUI!I92","v":0},{"$f":"iUI!J92","v":0},{"$f":"iUI!L92","v":0}]
[null,"U83",null,{"$f":"IF(iUI!D93<>\"\",iUI!D93,\"\")","v":""},{"$f":"IF(iUI!F93<>\"\",iUI!F93,\"\")","v":""},{"$f":"SUMIFS(iTABUF!$D$11:$D$109,iTABUF!$C$11:$C$109,B93)","v":0},{"$f":"SUMIFS(iTABUF!$E$11:$E$109,iTABUF!$C$11:$C$109,B93)","v":0},{"$f":"SUMIFS(iTABUF!$F$11:$F$109,iTABUF!$C$11:$C$109,B93)","v":0},{"$f":"SUMIFS(iTABUF!$G$11:$G$109,iTABUF!$C$11:$C$109,B93)","v":0},{"$f":"SUMIFS(iTABUF!$H$11:$H$109,iTABUF!$C$11:$C$109,B93)","v":0},{"$f":"SUMIFS(iTABUF!$I$11:$I$109,iTABUF!$C$11:$C$109,B93)","v":0},{"$f":"SUMIFS(iTABUF!$J$11:$J$109,iTABUF!$C$11:$C$109,B93)","v":0},{"$f":"SUMIFS(iTABUF!$K$11:$K$109,iTABUF!$C$11:$C$109,B93)","v":0},{"$f":"SUMIFS(iTABUF!$L$11:$L$109,iTABUF!$C$11:$C$109,B93)","v":0},{"$f":"SUMIFS(iTABUF!$M$11:$M$109,iTABUF!$C$11:$C$109,B93)","v":0},{"$f":"iUI!I93","v":0},{"$f":"iUI!J93","v":0},{"$f":"iUI!L93","v":0}]
[null,"U84",null,{"$f":"IF(iUI!D94<>\"\",iUI!D94,\"\")","v":""},{"$f":"IF(iUI!F94<>\"\",iUI!F94,\"\")","v":""},{"$f":"SUMIFS(iTABUF!$D$11:$D$109,iTABUF!$C$11:$C$109,B94)","v":0},{"$f":"SUMIFS(iTABUF!$E$11:$E$109,iTABUF!$C$11:$C$109,B94)","v":0},{"$f":"SUMIFS(iTABUF!$F$11:$F$109,iTABUF!$C$11:$C$109,B94)","v":0},{"$f":"SUMIFS(iTABUF!$G$11:$G$109,iTABUF!$C$11:$C$109,B94)","v":0},{"$f":"SUMIFS(iTABUF!$H$11:$H$109,iTABUF!$C$11:$C$109,B94)","v":0},{"$f":"SUMIFS(iTABUF!$I$11:$I$109,iTABUF!$C$11:$C$109,B94)","v":0},{"$f":"SUMIFS(iTABUF!$J$11:$J$109,iTABUF!$C$11:$C$109,B94)","v":0},{"$f":"SUMIFS(iTABUF!$K$11:$K$109,iTABUF!$C$11:$C$109,B94)","v":0},{"$f":"SUMIFS(iTABUF!$L$11:$L$109,iTABUF!$C$11:$C$109,B94)","v":0},{"$f":"SUMIFS(iTABUF!$M$11:$M$109,iTABUF!$C$11:$C$109,B94)","v":0},{"$f":"iUI!I94","v":0},{"$f":"iUI!J94","v":0},{"$f":"iUI!L94","v":0}]
[null,"U85",null,{"$f":"IF(iUI!D95<>\"\",iUI!D95,\"\")","v":""},{"$f":"IF(iUI!F95<>\"\",iUI!F95,\"\")","v":""},{"$f":"SUMIFS(iTABUF!$D$11:$D$109,iTABUF!$C$11:$C$109,B95)","v":0},{"$f":"SUMIFS(iTABUF!$E$11:$E$109,iTABUF!$C$11:$C$109,B95)","v":0},{"$f":"SUMIFS(iTABUF!$F$11:$F$109,iTABUF!$C$11:$C$109,B95)","v":0},{"$f":"SUMIFS(iTABUF!$G$11:$G$109,iTABUF!$C$11:$C$109,B95)","v":0},{"$f":"SUMIFS(iTABUF!$H$11:$H$109,iTABUF!$C$11:$C$109,B95)","v":0},{"$f":"SUMIFS(iTABUF!$I$11:$I$109,iTABUF!$C$11:$C$109,B95)","v":0},{"$f":"SUMIFS(iTABUF!$J$11:$J$109,iTABUF!$C$11:$C$109,B95)","v":0},{"$f":"SUMIFS(iTABUF!$K$11:$K$109,iTABUF!$C$11:$C$109,B95)","v":0},{"$f":"SUMIFS(iTABUF!$L$11:$L$109,iTABUF!$C$11:$C$109,B95)","v":0},{"$f":"SUMIFS(iTABUF!$M$11:$M$109,iTABUF!$C$11:$C$109,B95)","v":0},{"$f":"iUI!I95","v":0},{"$f":"iUI!J95","v":0},{"$f":"iUI!L95","v":0}]
[null,"U86",null,{"$f":"IF(iUI!D96<>\"\",iUI!D96,\"\")","v":""},{"$f":"IF(iUI!F96<>\"\",iUI!F96,\"\")","v":""},{"$f":"SUMIFS(iTABUF!$D$11:$D$109,iTABUF!$C$11:$C$109,B96)","v":0},{"$f":"SUMIFS(iTABUF!$E$11:$E$109,iTABUF!$C$11:$C$109,B96)","v":0},{"$f":"SUMIFS(iTABUF!$F$11:$F$109,iTABUF!$C$11:$C$109,B96)","v":0},{"$f":"SUMIFS(iTABUF!$G$11:$G$109,iTABUF!$C$11:$C$109,B96)","v":0},{"$f":"SUMIFS(iTABUF!$H$11:$H$109,iTABUF!$C$11:$C$109,B96)","v":0},{"$f":"SUMIFS(iTABUF!$I$11:$I$109,iTABUF!$C$11:$C$109,B96)","v":0},{"$f":"SUMIFS(iTABUF!$J$11:$J$109,iTABUF!$C$11:$C$109,B96)","v":0},{"$f":"SUMIFS(iTABUF!$K$11:$K$109,iTABUF!$C$11:$C$109,B96)","v":0},{"$f":"SUMIFS(iTABUF!$L$11:$L$109,iTABUF!$C$11:$C$109,B96)","v":0},{"$f":"SUMIFS(iTABUF!$M$11:$M$109,iTABUF!$C$11:$C$109,B96)","v":0},{"$f":"iUI!I96","v":0},{"$f":"iUI!J96","v":0},{"$f":"iUI!L96","v":0}]
[null,"U87",null,{"$f":"IF(iUI!D97<>\"\",iUI!D97,\"\")","v":""},{"$f":"IF(iUI!F97<>\"\",iUI!F97,\"\")","v":""},{"$f":"SUMIFS(iTABUF!$D$11:$D$109,iTABUF!$C$11:$C$109,B97)","v":0},{"$f":"SUMIFS(iTABUF!$E$11:$E$109,iTABUF!$C$11:$C$109,B97)","v":0},{"$f":"SUMIFS(iTABUF!$F$11:$F$109,iTABUF!$C$11:$C$109,B97)","v":0},{"$f":"SUMIFS(iTABUF!$G$11:$G$109,iTABUF!$C$11:$C$109,B97)","v":0},{"$f":"SUMIFS(iTABUF!$H$11:$H$109,iTABUF!$C$11:$C$109,B97)","v":0},{"$f":"SUMIFS(iTABUF!$I$11:$I$109,iTABUF!$C$11:$C$109,B97)","v":0},{"$f":"SUMIFS(iTABUF!$J$11:$J$109,iTABUF!$C$11:$C$109,B97)","v":0},{"$f":"SUMIFS(iTABUF!$K$11:$K$109,iTABUF!$C$11:$C$109,B97)","v":0},{"$f":"SUMIFS(iTABUF!$L$11:$L$109,iTABUF!$C$11:$C$109,B97)","v":0},{"$f":"SUMIFS(iTABUF!$M$11:$M$109,iTABUF!$C$11:$C$109,B97)","v":0},{"$f":"iUI!I97","v":0},{"$f":"iUI!J97","v":0},{"$f":"iUI!L97","v":0}]
[null,"U88",null,{"$f":"IF(iUI!D98<>\"\",iUI!D98,\"\")","v":""},{"$f":"IF(iUI!F98<>\"\",iUI!F98,\"\")","v":""},{"$f":"SUMIFS(iTABUF!$D$11:$D$109,iTABUF!$C$11:$C$109,B98)","v":0},{"$f":"SUMIFS(iTABUF!$E$11:$E$109,iTABUF!$C$11:$C$109,B98)","v":0},{"$f":"SUMIFS(iTABUF!$F$11:$F$109,iTABUF!$C$11:$C$109,B98)","v":0},{"$f":"SUMIFS(iTABUF!$G$11:$G$109,iTABUF!$C$11:$C$109,B98)","v":0},{"$f":"SUMIFS(iTABUF!$H$11:$H$109,iTABUF!$C$11:$C$109,B98)","v":0},{"$f":"SUMIFS(iTABUF!$I$11:$I$109,iTABUF!$C$11:$C$109,B98)","v":0},{"$f":"SUMIFS(iTABUF!$J$11:$J$109,iTABUF!$C$11:$C$109,B98)","v":0},{"$f":"SUMIFS(iTABUF!$K$11:$K$109,iTABUF!$C$11:$C$109,B98)","v":0},{"$f":"SUMIFS(iTABUF!$L$11:$L$109,iTABUF!$C$11:$C$109,B98)","v":0},{"$f":"SUMIFS(iTABUF!$M$11:$M$109,iTABUF!$C$11:$C$109,B98)","v":0},{"$f":"iUI!I98","v":0},{"$f":"iUI!J98","v":0},{"$f":"iUI!L98","v":0}]
[null,"U89",null,{"$f":"IF(iUI!D99<>\"\",iUI!D99,\"\")","v":""},{"$f":"IF(iUI!F99<>\"\",iUI!F99,\"\")","v":""},{"$f":"SUMIFS(iTABUF!$D$11:$D$109,iTABUF!$C$11:$C$109,B99)","v":0},{"$f":"SUMIFS(iTABUF!$E$11:$E$109,iTABUF!$C$11:$C$109,B99)","v":0},{"$f":"SUMIFS(iTABUF!$F$11:$F$109,iTABUF!$C$11:$C$109,B99)","v":0},{"$f":"SUMIFS(iTABUF!$G$11:$G$109,iTABUF!$C$11:$C$109,B99)","v":0},{"$f":"SUMIFS(iTABUF!$H$11:$H$109,iTABUF!$C$11:$C$109,B99)","v":0},{"$f":"SUMIFS(iTABUF!$I$11:$I$109,iTABUF!$C$11:$C$109,B99)","v":0},{"$f":"SUMIFS(iTABUF!$J$11:$J$109,iTABUF!$C$11:$C$109,B99)","v":0},{"$f":"SUMIFS(iTABUF!$K$11:$K$109,iTABUF!$C$11:$C$109,B99)","v":0},{"$f":"SUMIFS(iTABUF!$L$11:$L$109,iTABUF!$C$11:$C$109,B99)","v":0},{"$f":"SUMIFS(iTABUF!$M$11:$M$109,iTABUF!$C$11:$C$109,B99)","v":0},{"$f":"iUI!I99","v":0},{"$f":"iUI!J99","v":0},{"$f":"iUI!L99","v":0}]
[null,"U90",null,{"$f":"IF(iUI!D100<>\"\",iUI!D100,\"\")","v":""},{"$f":"IF(iUI!F100<>\"\",iUI!F100,\"\")","v":""},{"$f":"SUMIFS(iTABUF!$D$11:$D$109,iTABUF!$C$11:$C$109,B100)","v":0},{"$f":"SUMIFS(iTABUF!$E$11:$E$109,iTABUF!$C$11:$C$109,B100)","v":0},{"$f":"SUMIFS(iTABUF!$F$11:$F$109,iTABUF!$C$11:$C$109,B100)","v":0},{"$f":"SUMIFS(iTABUF!$G$11:$G$109,iTABUF!$C$11:$C$109,B100)","v":0},{"$f":"SUMIFS(iTABUF!$H$11:$H$109,iTABUF!$C$11:$C$109,B100)","v":0},{"$f":"SUMIFS(iTABUF!$I$11:$I$109,iTABUF!$C$11:$C$109,B100)","v":0},{"$f":"SUMIFS(iTABUF!$J$11:$J$109,iTABUF!$C$11:$C$109,B100)","v":0},{"$f":"SUMIFS(iTABUF!$K$11:$K$109,iTABUF!$C$11:$C$109,B100)","v":0},{"$f":"SUMIFS(iTABUF!$L$11:$L$109,iTABUF!$C$11:$C$109,B100)","v":0},{"$f":"SUMIFS(iTABUF!$M$11:$M$109,iTABUF!$C$11:$C$109,B100)","v":0},{"$f":"iUI!I100","v":0},{"$f":"iUI!J100","v":0},{"$f":"iUI!L100","v":0}]
[null,"U91",null,{"$f":"IF(iUI!D101<>\"\",iUI!D101,\"\")","v":""},{"$f":"IF(iUI!F101<>\"\",iUI!F101,\"\")","v":""},{"$f":"SUMIFS(iTABUF!$D$11:$D$109,iTABUF!$C$11:$C$109,B101)","v":0},{"$f":"SUMIFS(iTABUF!$E$11:$E$109,iTABUF!$C$11:$C$109,B101)","v":0},{"$f":"SUMIFS(iTABUF!$F$11:$F$109,iTABUF!$C$11:$C$109,B101)","v":0},{"$f":"SUMIFS(iTABUF!$G$11:$G$109,iTABUF!$C$11:$C$109,B101)","v":0},{"$f":"SUMIFS(iTABUF!$H$11:$H$109,iTABUF!$C$11:$C$109,B101)","v":0},{"$f":"SUMIFS(iTABUF!$I$11:$I$109,iTABUF!$C$11:$C$109,B101)","v":0},{"$f":"SUMIFS(iTABUF!$J$11:$J$109,iTABUF!$C$11:$C$109,B101)","v":0},{"$f":"SUMIFS(iTABUF!$K$11:$K$109,iTABUF!$C$11:$C$109,B101)","v":0},{"$f":"SUMIFS(iTABUF!$L$11:$L$109,iTABUF!$C$11:$C$109,B101)","v":0},{"$f":"SUMIFS(iTABUF!$M$11:$M$109,iTABUF!$C$11:$C$109,B101)","v":0},{"$f":"iUI!I101","v":0},{"$f":"iUI!J101","v":0},{"$f":"iUI!L101","v":0}]
[null,"U92",null,{"$f":"IF(iUI!D102<>\"\",iUI!D102,\"\")","v":""},{"$f":"IF(iUI!F102<>\"\",iUI!F102,\"\")","v":""},{"$f":"SUMIFS(iTABUF!$D$11:$D$109,iTABUF!$C$11:$C$109,B102)","v":0},{"$f":"SUMIFS(iTABUF!$E$11:$E$109,iTABUF!$C$11:$C$109,B102)","v":0},{"$f":"SUMIFS(iTABUF!$F$11:$F$109,iTABUF!$C$11:$C$109,B102)","v":0},{"$f":"SUMIFS(iTABUF!$G$11:$G$109,iTABUF!$C$11:$C$109,B102)","v":0},{"$f":"SUMIFS(iTABUF!$H$11:$H$109,iTABUF!$C$11:$C$109,B102)","v":0},{"$f":"SUMIFS(iTABUF!$I$11:$I$109,iTABUF!$C$11:$C$109,B102)","v":0},{"$f":"SUMIFS(iTABUF!$J$11:$J$109,iTABUF!$C$11:$C$109,B102)","v":0},{"$f":"SUMIFS(iTABUF!$K$11:$K$109,iTABUF!$C$11:$C$109,B102)","v":0},{"$f":"SUMIFS(iTABUF!$L$11:$L$109,iTABUF!$C$11:$C$109,B102)","v":0},{"$f":"SUMIFS(iTABUF!$M$11:$M$109,iTABUF!$C$11:$C$109,B102)","v":0},{"$f":"iUI!I102","v":0},{"$f":"iUI!J102","v":0},{"$f":"iUI!L102","v":0}]
[null,"U93",null,{"$f":"IF(iUI!D103<>\"\",iUI!D103,\"\")","v":""},{"$f":"IF(iUI!F103<>\"\",iUI!F103,\"\")","v":""},{"$f":"SUMIFS(iTABUF!$D$11:$D$109,iTABUF!$C$11:$C$109,B103)","v":0},{"$f":"SUMIFS(iTABUF!$E$11:$E$109,iTABUF!$C$11:$C$109,B103)","v":0},{"$f":"SUMIFS(iTABUF!$F$11:$F$109,iTABUF!$C$11:$C$109,B103)","v":0},{"$f":"SUMIFS(iTABUF!$G$11:$G$109,iTABUF!$C$11:$C$109,B103)","v":0},{"$f":"SUMIFS(iTABUF!$H$11:$H$109,iTABUF!$C$11:$C$109,B103)","v":0},{"$f":"SUMIFS(iTABUF!$I$11:$I$109,iTABUF!$C$11:$C$109,B103)","v":0},{"$f":"SUMIFS(iTABUF!$J$11:$J$109,iTABUF!$C$11:$C$109,B103)","v":0},{"$f":"SUMIFS(iTABUF!$K$11:$K$109,iTABUF!$C$11:$C$109,B103)","v":0},{"$f":"SUMIFS(iTABUF!$L$11:$L$109,iTABUF!$C$11:$C$109,B103)","v":0},{"$f":"SUMIFS(iTABUF!$M$11:$M$109,iTABUF!$C$11:$C$109,B103)","v":0},{"$f":"iUI!I103","v":0},{"$f":"iUI!J103","v":0},{"$f":"iUI!L103","v":0}]
[null,"U94",null,{"$f":"IF(iUI!D104<>\"\",iUI!D104,\"\")","v":""},{"$f":"IF(iUI!F104<>\"\",iUI!F104,\"\")","v":""},{"$f":"SUMIFS(iTABUF!$D$11:$D$109,iTABUF!$C$11:$C$109,B104)","v":0},{"$f":"SUMIFS(iTABUF!$E$11:$E$109,iTABUF!$C$11:$C$109,B104)","v":0},{"$f":"SUMIFS(iTABUF!$F$11:$F$109,iTABUF!$C$11:$C$109,B104)","v":0},{"$f":"SUMIFS(iTABUF!$G$11:$G$109,iTABUF!$C$11:$C$109,B104)","v":0},{"$f":"SUMIFS(iTABUF!$H$11:$H$109,iTABUF!$C$11:$C$109,B104)","v":0},{"$f":"SUMIFS(iTABUF!$I$11:$I$109,iTABUF!$C$11:$C$109,B104)","v":0},{"$f":"SUMIFS(iTABUF!$J$11:$J$109,iTABUF!$C$11:$C$109,B104)","v":0},{"$f":"SUMIFS(iTABUF!$K$11:$K$109,iTABUF!$C$11:$C$109,B104)","v":0},{"$f":"SUMIFS(iTABUF!$L$11:$L$109,iTABUF!$C$11:$C$109,B104)","v":0},{"$f":"SUMIFS(iTABUF!$M$11:$M$109,iTABUF!$C$11:$C$109,B104)","v":0},{"$f":"iUI!I104","v":0},{"$f":"iUI!J104","v":0},{"$f":"iUI!L104","v":0}]
[null,"U95",null,{"$f":"IF(iUI!D105<>\"\",iUI!D105,\"\")","v":""},{"$f":"IF(iUI!F105<>\"\",iUI!F105,\"\")","v":""},{"$f":"SUMIFS(iTABUF!$D$11:$D$109,iTABUF!$C$11:$C$109,B105)","v":0},{"$f":"SUMIFS(iTABUF!$E$11:$E$109,iTABUF!$C$11:$C$109,B105)","v":0},{"$f":"SUMIFS(iTABUF!$F$11:$F$109,iTABUF!$C$11:$C$109,B105)","v":0},{"$f":"SUMIFS(iTABUF!$G$11:$G$109,iTABUF!$C$11:$C$109,B105)","v":0},{"$f":"SUMIFS(iTABUF!$H$11:$H$109,iTABUF!$C$11:$C$109,B105)","v":0},{"$f":"SUMIFS(iTABUF!$I$11:$I$109,iTABUF!$C$11:$C$109,B105)","v":0},{"$f":"SUMIFS(iTABUF!$J$11:$J$109,iTABUF!$C$11:$C$109,B105)","v":0},{"$f":"SUMIFS(iTABUF!$K$11:$K$109,iTABUF!$C$11:$C$109,B105)","v":0},{"$f":"SUMIFS(iTABUF!$L$11:$L$109,iTABUF!$C$11:$C$109,B105)","v":0},{"$f":"SUMIFS(iTABUF!$M$11:$M$109,iTABUF!$C$11:$C$109,B105)","v":0},{"$f":"iUI!I105","v":0},{"$f":"iUI!J105","v":0},{"$f":"iUI!L105","v":0}]
[null,"U96",null,{"$f":"IF(iUI!D106<>\"\",iUI!D106,\"\")","v":""},{"$f":"IF(iUI!F106<>\"\",iUI!F106,\"\")","v":""},{"$f":"SUMIFS(iTABUF!$D$11:$D$109,iTABUF!$C$11:$C$109,B106)","v":0},{"$f":"SUMIFS(iTABUF!$E$11:$E$109,iTABUF!$C$11:$C$109,B106)","v":0},{"$f":"SUMIFS(iTABUF!$F$11:$F$109,iTABUF!$C$11:$C$109,B106)","v":0},{"$f":"SUMIFS(iTABUF!$G$11:$G$109,iTABUF!$C$11:$C$109,B106)","v":0},{"$f":"SUMIFS(iTABUF!$H$11:$H$109,iTABUF!$C$11:$C$109,B106)","v":0},{"$f":"SUMIFS(iTABUF!$I$11:$I$109,iTABUF!$C$11:$C$109,B106)","v":0},{"$f":"SUMIFS(iTABUF!$J$11:$J$109,iTABUF!$C$11:$C$109,B106)","v":0},{"$f":"SUMIFS(iTABUF!$K$11:$K$109,iTABUF!$C$11:$C$109,B106)","v":0},{"$f":"SUMIFS(iTABUF!$L$11:$L$109,iTABUF!$C$11:$C$109,B106)","v":0},{"$f":"SUMIFS(iTABUF!$M$11:$M$109,iTABUF!$C$11:$C$109,B106)","v":0},{"$f":"iUI!I106","v":0},{"$f":"iUI!J106","v":0},{"$f":"iUI!L106","v":0}]
[null,"U97",null,{"$f":"IF(iUI!D107<>\"\",iUI!D107,\"\")","v":""},{"$f":"IF(iUI!F107<>\"\",iUI!F107,\"\")","v":""},{"$f":"SUMIFS(iTABUF!$D$11:$D$109,iTABUF!$C$11:$C$109,B107)","v":0},{"$f":"SUMIFS(iTABUF!$E$11:$E$109,iTABUF!$C$11:$C$109,B107)","v":0},{"$f":"SUMIFS(iTABUF!$F$11:$F$109,iTABUF!$C$11:$C$109,B107)","v":0},{"$f":"SUMIFS(iTABUF!$G$11:$G$109,iTABUF!$C$11:$C$109,B107)","v":0},{"$f":"SUMIFS(iTABUF!$H$11:$H$109,iTABUF!$C$11:$C$109,B107)","v":0},{"$f":"SUMIFS(iTABUF!$I$11:$I$109,iTABUF!$C$11:$C$109,B107)","v":0},{"$f":"SUMIFS(iTABUF!$J$11:$J$109,iTABUF!$C$11:$C$109,B107)","v":0},{"$f":"SUMIFS(iTABUF!$K$11:$K$109,iTABUF!$C$11:$C$109,B107)","v":0},{"$f":"SUMIFS(iTABUF!$L$11:$L$109,iTABUF!$C$11:$C$109,B107)","v":0},{"$f":"SUMIFS(iTABUF!$M$11:$M$109,iTABUF!$C$11:$C$109,B107)","v":0},{"$f":"iUI!I107","v":0},{"$f":"iUI!J107","v":0},{"$f":"iUI!L107","v":0}]
[null,"U98",null,{"$f":"IF(iUI!D108<>\"\",iUI!D108,\"\")","v":""},{"$f":"IF(iUI!F108<>\"\",iUI!F108,\"\")","v":""},{"$f":"SUMIFS(iTABUF!$D$11:$D$109,iTABUF!$C$11:$C$109,B108)","v":0},{"$f":"SUMIFS(iTABUF!$E$11:$E$109,iTABUF!$C$11:$C$109,B108)","v":0},{"$f":"SUMIFS(iTABUF!$F$11:$F$109,iTABUF!$C$11:$C$109,B108)","v":0},{"$f":"SUMIFS(iTABUF!$G$11:$G$109,iTABUF!$C$11:$C$109,B108)","v":0},{"$f":"SUMIFS(iTABUF!$H$11:$H$109,iTABUF!$C$11:$C$109,B108)","v":0},{"$f":"SUMIFS(iTABUF!$I$11:$I$109,iTABUF!$C$11:$C$109,B108)","v":0},{"$f":"SUMIFS(iTABUF!$J$11:$J$109,iTABUF!$C$11:$C$109,B108)","v":0},{"$f":"SUMIFS(iTABUF!$K$11:$K$109,iTABUF!$C$11:$C$109,B108)","v":0},{"$f":"SUMIFS(iTABUF!$L$11:$L$109,iTABUF!$C$11:$C$109,B108)","v":0},{"$f":"SUMIFS(iTABUF!$M$11:$M$109,iTABUF!$C$11:$C$109,B108)","v":0},{"$f":"iUI!I108","v":0},{"$f":"iUI!J108","v":0},{"$f":"iUI!L108","v":0}]
[null,"U99",null,{"$f":"IF(iUI!D109<>\"\",iUI!D109,\"\")","v":""},{"$f":"IF(iUI!F109<>\"\",iUI!F109,\"\")","v":""},{"$f":"SUMIFS(iTABUF!$D$11:$D$109,iTABUF!$C$11:$C$109,B109)","v":0},{"$f":"SUMIFS(iTABUF!$E$11:$E$109,iTABUF!$C$11:$C$109,B109)","v":0},{"$f":"SUMIFS(iTABUF!$F$11:$F$109,iTABUF!$C$11:$C$109,B109)","v":0},{"$f":"SUMIFS(iTABUF!$G$11:$G$109,iTABUF!$C$11:$C$109,B109)","v":0},{"$f":"SUMIFS(iTABUF!$H$11:$H$109,iTABUF!$C$11:$C$109,B109)","v":0},{"$f":"SUMIFS(iTABUF!$I$11:$I$109,iTABUF!$C$11:$C$109,B109)","v":0},{"$f":"SUMIFS(iTABUF!$J$11:$J$109,iTABUF!$C$11:$C$109,B109)","v":0},{"$f":"SUMIFS(iTABUF!$K$11:$K$109,iTABUF!$C$11:$C$109,B109)","v":0},{"$f":"SUMIFS(iTABUF!$L$11:$L$109,iTABUF!$C$11:$C$109,B109)","v":0},{"$f":"SUMIFS(iTABUF!$M$11:$M$109,iTABUF!$C$11:$C$109,B109)","v":0},{"$f":"iUI!I109","v":0},{"$f":"iUI!J109","v":0},{"$f":"iUI!L109","v":0}]
[null,null,null,null,"TOTALI",{"$f":"SUM(F11:F109)","v":1000},1000.0000000000002,1000.0000000000002,1000,1000,0,0,0,0,0]

{"sheet":"cTABCO","index":17,"n_rows":110,"n_cols":14,"rows_kept":110,"cut":false,"hidden":true,"merged":[[8,0,9,0],[8,2,9,2]]}
[null,"Questo prospetto è interamente generato dalla procedura e non deve essere mai variato direttamente e manualmente dall'utilizzatore. "]
[]
[]
[]
[null,{"$f":"NomeCondominio()","v":"Condominio Palazzo Duck"}]
[]
[null,"TABELLE MILLESIMALI per CONDOMINI"]
[]
[null,"Codice","CONDOMINO","Tabella A","Tabella B","Tabella C","Tabella D","Tabella E","Tabella F","Tabella G","Tabella H","Tabella I","Tabella J","Codici"]
[null,"Condomino ",null,{"$f":"iDG!$B52","v":"Proprietà"},{"$f":"iDG!$B53","v":"Scala"},{"$f":"iDG!$B54","v":"Ascensore"},{"$f":"iDG!$B55","v":"Abitazioni"},{"$f":"iDG!$B56","v":"Negozi"},{"$f":"iDG!$B57","v":0},{"$f":"iDG!$B58","v":0},{"$f":"iDG!$B59","v":0},{"$f":"iDG!$B60","v":0},{"$f":"iDG!$B61","v":0},"U.I.\nPOSSEDUTE"]
[null,{"$f":"IF(iCONDOMINI!B11<>\"\",iCONDOMINI!B11,\"\")","v":"C01"},{"$f":"IF(iCONDOMINI!C11<>\"\",iCONDOMINI!C11,\"\")","v":"Paperoga"},{"$f":"IF(B11<>\"\",SUMIFS(cTABUI!$F$11:$F$109,cTABUI!$D$11:$D$109,B11),0)","v":52.392000000000003},{"$f":"IF(B11<>\"\",SUMIFS(cTABUI!$G$11:$G$109,cTABUI!$D$11:$D$109,B11),0)","v":0},{"$f":"IF(B11<>\"\",SUMIFS(cTABUI!$H$11:$H$109,cTABUI!$D$11:$D$109,B11),0)","v":0},{"$f":"IF(B11<>\"\",SUMIFS(cTABUI!$I$11:$I$109,cTABUI!$D$11:$D$109,B11),0)","v":0},{"$f":"IF(B11<>\"\",SUMIFS(cTABUI!$J$11:$J$109,cTABUI!$D$11:$D$109,B11),0)","v":161.221},{"$f":"IF(B11<>\"\",SUMIFS(cTABUI!$K$11:$K$109,cTABUI!$D$11:$D$109,B11),0)","v":0},{"$f":"IF(B11<>\"\",SUMIFS(cTABUI!$L$11:$L$109,cTABUI!$D$11:$D$109,B11),0)","v":0},{"$f":"IF(B11<>\"\",SUMIFS(cTABUI!$M$11:$M$109,cTABUI!$D$11:$D$109,B11),0)","v":0},{"$f":"IF(B11<>\"\",SUMIFS(cTABUI!$N$11:$N$109,cTABUI!$D$11:$D$109,B11),0)","v":0},{"$f":"IF(B11<>\"\",SUMIFS(cTABUI!$O$11:$O$109,cTABUI!$D$11:$D$109,B11),0)","v":0},"U01"]
[null,{"$f":"IF(iCONDOMINI!B12<>\"\",iCONDOMINI!B12,\"\")","v":"C02"},{"$f":"IF(iCONDOMINI!C12<>\"\",iCONDOMINI!C12,\"\")","v":"Ciccio"},{"$f":"IF(B12<>\"\",SUMIFS(cTABUI!$F$11:$F$109,cTABUI!$D$11:$D$109,B12),0)","v":35.476999999999997},{"$f":"IF(B12<>\"\",SUMIFS(cTABUI!$G$11:$G$109,cTABUI!$D$11:$D$109,B12),0)","v":0},{"$f":"IF(B12<>\"\",SUMIFS(cTABUI!$H$11:$H$109,cTABUI!$D$11:$D$109,B12),0)","v":0},{"$f":"IF(B12<>\"\",SUMIFS(cTABUI!$I$11:$I$109,cTABUI!$D$11:$D$109,B12),0)","v":0},{"$f":"IF(B12<>\"\",SUMIFS(cTABUI!$J$11:$J$109,cTABUI!$D$11:$D$109,B12),0)","v":109.17},{"$f":"IF(B12<>\"\",SUMIFS(cTABUI!$K$11:$K$109,cTABUI!$D$11:$D$109,B12),0)","v":0},{"$f":"IF(B12<>\"\",SUMIFS(cTABUI!$L$11:$L$109,cTABUI!$D$11:$D$109,B12),0)","v":0},{"$f":"IF(B12<>\"\",SUMIFS(cTABUI!$M$11:$M$109,cTABUI!$D$11:$D$109,B12),0)","v":0},{"$f":"IF(B12<>\"\",SUMIFS(cTABUI!$N$11:$N$109,cTABUI!$D$11:$D$109,B12),0)","v":0},{"$f":"IF(B12<>\"\",SUMIFS(cTABUI!$O$11:$O$109,cTABUI!$D$11:$D$109,B12),0)","v":0},"U02"]
[null,{"$f":"IF(iCONDOMINI!B13<>\"\",iCONDOMINI!B13,\"\")","v":"C03"},{"$f":"IF(iCONDOMINI!C13<>\"\",iCONDOMINI!C13,\"\")","v":"Gastone"},{"$f":"IF(B13<>\"\",SUMIFS(cTABUI!$F$11:$F$109,cTABUI!$D$11:$D$109,B13),0)","v":100.43899999999999},{"$f":"IF(B13<>\"\",SUMIFS(cTABUI!$G$11:$G$109,cTABUI!$D$11:$D$109,B13),0)","v":0},{"$f":"IF(B13<>\"\",SUMIFS(cTABUI!$H$11:$H$109,cTABUI!$D$11:$D$109,B13),0)","v":0},{"$f":"IF(B13<>\"\",SUMIFS(cTABUI!$I$11:$I$109,cTABUI!$D$11:$D$109,B13),0)","v":0},{"$f":"IF(B13<>\"\",SUMIFS(cTABUI!$J$11:$J$109,cTABUI!$D$11:$D$109,B13),0)","v":309.06900000000002},{"$f":"IF(B13<>\"\",SUMIFS(cTABUI!$K$11:$K$109,cTABUI!$D$11:$D$109,B13),0)","v":0},{"$f":"IF(B13<>\"\",SUMIFS(cTABUI!$L$11:$L$109,cTABUI!$D$11:$D$109,B13),0)","v":0},{"$f":"IF(B13<>\"\",SUMIFS(cTABUI!$M$11:$M$109,cTABUI!$D$11:$D$109,B13),0)","v":0},{"$f":"IF(B13<>\"\",SUMIFS(cTABUI!$N$11:$N$109,cTABUI!$D$11:$D$109,B13),0)","v":0},{"$f":"IF(B13<>\"\",SUMIFS(cTABUI!$O$11:$O$109,cTABUI!$D$11:$D$109,B13),0)","v":0},"U03"]
[null,{"$f":"IF(iCONDOMINI!B14<>\"\",iCONDOMINI!B14,\"\")","v":"C04"},{"$f":"IF(iCONDOMINI!C14<>\"\",iCONDOMINI!C14,\"\")","v":"I tre nipotini"},{"$f":"IF(B14<>\"\",SUMIFS(cTABUI!$F$11:$F$109,cTABUI!$D$11:$D$109,B14),0)","v":136.66399999999999},{"$f":"IF(B14<>\"\",SUMIFS(cTABUI!$G$11:$G$109,cTABUI!$D$11:$D$109,B14),0)","v":0},{"$f":"IF(B14<>\"\",SUMIFS(cTABUI!$H$11:$H$109,cTABUI!$D$11:$D$109,B14),0)","v":0},{"$f":"IF(B14<>\"\",SUMIFS(cTABUI!$I$11:$I$109,cTABUI!$D$11:$D$109,B14),0)","v":0},{"$f":"IF(B14<>\"\",SUMIFS(cTABUI!$J$11:$J$109,cTABUI!$D$11:$D$109,B14),0)","v":420.54},{"$f":"IF(B14<>\"\",SUMIFS(cTABUI!$K$11:$K$109,cTABUI!$D$11:$D$109,B14),0)","v":0},{"$f":"IF(B14<>\"\",SUMIFS(cTABUI!$L$11:$L$109,cTABUI!$D$11:$D$109,B14),0)","v":0},{"$f":"IF(B14<>\"\",SUMIFS(cTABUI!$M$11:$M$109,cTABUI!$D$11:$D$109,B14),0)","v":0},{"$f":"IF(B14<>\"\",SUMIFS(cTABUI!$N$11:$N$109,cTABUI!$D$11:$D$109,B14),0)","v":0},{"$f":"IF(B14<>\"\",SUMIFS(cTABUI!$O$11:$O$109,cTABUI!$D$11:$D$109,B14),0)","v":0},"U04"]
[null,{"$f":"IF(iCONDOMINI!B15<>\"\",iCONDOMINI!B15,\"\")","v":"C05"},{"$f":"IF(iCONDOMINI!C15<>\"\",iCONDOMINI!C15,\"\")","v":"Nonna Papera"},{"$f":"IF(B15<>\"\",SUMIFS(cTABUI!$F$11:$F$109,cTABUI!$D$11:$D$109,B15),0)","v":327.80699999999996},{"$f":"IF(B15<>\"\",SUMIFS(cTABUI!$G$11:$G$109,cTABUI!$D$11:$D$109,B15),0)","v":439.86400000000003},{"$f":"IF(B15<>\"\",SUMIFS(cTABUI!$H$11:$H$109,cTABUI!$D$11:$D$109,B15),0)","v":439.86400000000003},{"$f":"IF(B15<>\"\",SUMIFS(cTABUI!$I$11:$I$109,cTABUI!$D$11:$D$109,B15),0)","v":485.62100000000004},{"$f":"IF(B15<>\"\",SUMIFS(cTABUI!$J$11:$J$109,cTABUI!$D$11:$D$109,B15),0)","v":0},{"$f":"IF(B15<>\"\",SUMIFS(cTABUI!$K$11:$K$109,cTABUI!$D$11:$D$109,B15),0)","v":0},{"$f":"IF(B15<>\"\",SUMIFS(cTABUI!$L$11:$L$109,cTABUI!$D$11:$D$109,B15),0)","v":0},{"$f":"IF(B15<>\"\",SUMIFS(cTABUI!$M$11:$M$109,cTABUI!$D$11:$D$109,B15),0)","v":0},{"$f":"IF(B15<>\"\",SUMIFS(cTABUI!$N$11:$N$109,cTABUI!$D$11:$D$109,B15),0)","v":0},{"$f":"IF(B15<>\"\",SUMIFS(cTABUI!$O$11:$O$109,cTABUI!$D$11:$D$109,B15),0)","v":0},"U05 + U06 + U09"]
[null,{"$f":"IF(iCONDOMINI!B16<>\"\",iCONDOMINI!B16,\"\")","v":"C06"},{"$f":"IF(iCONDOMINI!C16<>\"\",iCONDOMINI!C16,\"\")","v":"Fidanzati Paperino-Paperina"},{"$f":"IF(B16<>\"\",SUMIFS(cTABUI!$F$11:$F$109,cTABUI!$D$11:$D$109,B16),0)","v":347.22100000000006},{"$f":"IF(B16<>\"\",SUMIFS(cTABUI!$G$11:$G$109,cTABUI!$D$11:$D$109,B16),0)","v":560.13600000000019},{"$f":"IF(B16<>\"\",SUMIFS(cTABUI!$H$11:$H$109,cTABUI!$D$11:$D$109,B16),0)","v":560.13600000000019},{"$f":"IF(B16<>\"\",SUMIFS(cTABUI!$I$11:$I$109,cTABUI!$D$11:$D$109,B16),0)","v":514.37900000000002},{"$f":"IF(B16<>\"\",SUMIFS(cTABUI!$J$11:$J$109,cTABUI!$D$11:$D$109,B16),0)","v":0},{"$f":"IF(B16<>\"\",SUMIFS(cTABUI!$K$11:$K$109,cTABUI!$D$11:$D$109,B16),0)","v":0},{"$f":"IF(B16<>\"\",SUMIFS(cTABUI!$L$11:$L$109,cTABUI!$D$11:$D$109,B16),0)","v":0},{"$f":"IF(B16<>\"\",SUMIFS(cTABUI!$M$11:$M$109,cTABUI!$D$11:$D$109,B16),0)","v":0},{"$f":"IF(B16<>\"\",SUMIFS(cTABUI!$N$11:$N$109,cTABUI!$D$11:$D$109,B16),0)","v":0},{"$f":"IF(B16<>\"\",SUMIFS(cTABUI!$O$11:$O$109,cTABUI!$D$11:$D$109,B16),0)","v":0},"U07 + U08"]
[null,{"$f":"IF(iCONDOMINI!B17<>\"\",iCONDOMINI!B17,\"\")","v":"C07"},{"$f":"IF(iCONDOMINI!C17<>\"\",iCONDOMINI!C17,\"\")","v":""},{"$f":"IF(B17<>\"\",SUMIFS(cTABUI!$F$11:$F$109,cTABUI!$D$11:$D$109,B17),0)","v":0},{"$f":"IF(B17<>\"\",SUMIFS(cTABUI!$G$11:$G$109,cTABUI!$D$11:$D$109,B17),0)","v":0},{"$f":"IF(B17<>\"\",SUMIFS(cTABUI!$H$11:$H$109,cTABUI!$D$11:$D$109,B17),0)","v":0},{"$f":"IF(B17<>\"\",SUMIFS(cTABUI!$I$11:$I$109,cTABUI!$D$11:$D$109,B17),0)","v":0},{"$f":"IF(B17<>\"\",SUMIFS(cTABUI!$J$11:$J$109,cTABUI!$D$11:$D$109,B17),0)","v":0},{"$f":"IF(B17<>\"\",SUMIFS(cTABUI!$K$11:$K$109,cTABUI!$D$11:$D$109,B17),0)","v":0},{"$f":"IF(B17<>\"\",SUMIFS(cTABUI!$L$11:$L$109,cTABUI!$D$11:$D$109,B17),0)","v":0},{"$f":"IF(B17<>\"\",SUMIFS(cTABUI!$M$11:$M$109,cTABUI!$D$11:$D$109,B17),0)","v":0},{"$f":"IF(B17<>\"\",SUMIFS(cTABUI!$N$11:$N$109,cTABUI!$D$11:$D$109,B17),0)","v":0},{"$f":"IF(B17<>\"\",SUMIFS(cTABUI!$O$11:$O$109,cTABUI!$D$11:$D$109,B17),0)","v":0}]
[null,{"$f":"IF(iCONDOMINI!B18<>\"\",iCONDOMINI!B18,\"\")","v":"C08"},{"$f":"IF(iCONDOMINI!C18<>\"\",iCONDOMINI!C18,\"\")","v":""},{"$f":"IF(B18<>\"\",SUMIFS(cTABUI!$F$11:$F$109,cTABUI!$D$11:$D$109,B18),0)","v":0},{"$f":"IF(B18<>\"\",SUMIFS(cTABUI!$G$11:$G$109,cTABUI!$D$11:$D$109,B18),0)","v":0},{"$f":"IF(B18<>\"\",SUMIFS(cTABUI!$H$11:$H$109,cTABUI!$D$11:$D$109,B18),0)","v":0},{"$f":"IF(B18<>\"\",SUMIFS(cTABUI!$I$11:$I$109,cTABUI!$D$11:$D$109,B18),0)","v":0},{"$f":"IF(B18<>\"\",SUMIFS(cTABUI!$J$11:$J$109,cTABUI!$D$11:$D$109,B18),0)","v":0},{"$f":"IF(B18<>\"\",SUMIFS(cTABUI!$K$11:$K$109,cTABUI!$D$11:$D$109,B18),0)","v":0},{"$f":"IF(B18<>\"\",SUMIFS(cTABUI!$L$11:$L$109,cTABUI!$D$11:$D$109,B18),0)","v":0},{"$f":"IF(B18<>\"\",SUMIFS(cTABUI!$M$11:$M$109,cTABUI!$D$11:$D$109,B18),0)","v":0},{"$f":"IF(B18<>\"\",SUMIFS(cTABUI!$N$11:$N$109,cTABUI!$D$11:$D$109,B18),0)","v":0},{"$f":"IF(B18<>\"\",SUMIFS(cTABUI!$O$11:$O$109,cTABUI!$D$11:$D$109,B18),0)","v":0}]
[null,{"$f":"IF(iCONDOMINI!B19<>\"\",iCONDOMINI!B19,\"\")","v":"C09"},{"$f":"IF(iCONDOMINI!C19<>\"\",iCONDOMINI!C19,\"\")","v":""},{"$f":"IF(B19<>\"\",SUMIFS(cTABUI!$F$11:$F$109,cTABUI!$D$11:$D$109,B19),0)","v":0},{"$f":"IF(B19<>\"\",SUMIFS(cTABUI!$G$11:$G$109,cTABUI!$D$11:$D$109,B19),0)","v":0},{"$f":"IF(B19<>\"\",SUMIFS(cTABUI!$H$11:$H$109,cTABUI!$D$11:$D$109,B19),0)","v":0},{"$f":"IF(B19<>\"\",SUMIFS(cTABUI!$I$11:$I$109,cTABUI!$D$11:$D$109,B19),0)","v":0},{"$f":"IF(B19<>\"\",SUMIFS(cTABUI!$J$11:$J$109,cTABUI!$D$11:$D$109,B19),0)","v":0},{"$f":"IF(B19<>\"\",SUMIFS(cTABUI!$K$11:$K$109,cTABUI!$D$11:$D$109,B19),0)","v":0},{"$f":"IF(B19<>\"\",SUMIFS(cTABUI!$L$11:$L$109,cTABUI!$D$11:$D$109,B19),0)","v":0},{"$f":"IF(B19<>\"\",SUMIFS(cTABUI!$M$11:$M$109,cTABUI!$D$11:$D$109,B19),0)","v":0},{"$f":"IF(B19<>\"\",SUMIFS(cTABUI!$N$11:$N$109,cTABUI!$D$11:$D$109,B19),0)","v":0},{"$f":"IF(B19<>\"\",SUMIFS(cTABUI!$O$11:$O$109,cTABUI!$D$11:$D$109,B19),0)","v":0}]
[null,{"$f":"IF(iCONDOMINI!B20<>\"\",iCONDOMINI!B20,\"\")","v":"C10"},{"$f":"IF(iCONDOMINI!C20<>\"\",iCONDOMINI!C20,\"\")","v":""},{"$f":"IF(B20<>\"\",SUMIFS(cTABUI!$F$11:$F$109,cTABUI!$D$11:$D$109,B20),0)","v":0},{"$f":"IF(B20<>\"\",SUMIFS(cTABUI!$G$11:$G$109,cTABUI!$D$11:$D$109,B20),0)","v":0},{"$f":"IF(B20<>\"\",SUMIFS(cTABUI!$H$11:$H$109,cTABUI!$D$11:$D$109,B20),0)","v":0},{"$f":"IF(B20<>\"\",SUMIFS(cTABUI!$I$11:$I$109,cTABUI!$D$11:$D$109,B20),0)","v":0},{"$f":"IF(B20<>\"\",SUMIFS(cTABUI!$J$11:$J$109,cTABUI!$D$11:$D$109,B20),0)","v":0},{"$f":"IF(B20<>\"\",SUMIFS(cTABUI!$K$11:$K$109,cTABUI!$D$11:$D$109,B20),0)","v":0},{"$f":"IF(B20<>\"\",SUMIFS(cTABUI!$L$11:$L$109,cTABUI!$D$11:$D$109,B20),0)","v":0},{"$f":"IF(B20<>\"\",SUMIFS(cTABUI!$M$11:$M$109,cTABUI!$D$11:$D$109,B20),0)","v":0},{"$f":"IF(B20<>\"\",SUMIFS(cTABUI!$N$11:$N$109,cTABUI!$D$11:$D$109,B20),0)","v":0},{"$f":"IF(B20<>\"\",SUMIFS(cTABUI!$O$11:$O$109,cTABUI!$D$11:$D$109,B20),0)","v":0}]
[null,{"$f":"IF(iCONDOMINI!B21<>\"\",iCONDOMINI!B21,\"\")","v":"C11"},{"$f":"IF(iCONDOMINI!C21<>\"\",iCONDOMINI!C21,\"\")","v":""},{"$f":"IF(B21<>\"\",SUMIFS(cTABUI!$F$11:$F$109,cTABUI!$D$11:$D$109,B21),0)","v":0},{"$f":"IF(B21<>\"\",SUMIFS(cTABUI!$G$11:$G$109,cTABUI!$D$11:$D$109,B21),0)","v":0},{"$f":"IF(B21<>\"\",SUMIFS(cTABUI!$H$11:$H$109,cTABUI!$D$11:$D$109,B21),0)","v":0},{"$f":"IF(B21<>\"\",SUMIFS(cTABUI!$I$11:$I$109,cTABUI!$D$11:$D$109,B21),0)","v":0},{"$f":"IF(B21<>\"\",SUMIFS(cTABUI!$J$11:$J$109,cTABUI!$D$11:$D$109,B21),0)","v":0},{"$f":"IF(B21<>\"\",SUMIFS(cTABUI!$K$11:$K$109,cTABUI!$D$11:$D$109,B21),0)","v":0},{"$f":"IF(B21<>\"\",SUMIFS(cTABUI!$L$11:$L$109,cTABUI!$D$11:$D$109,B21),0)","v":0},{"$f":"IF(B21<>\"\",SUMIFS(cTABUI!$M$11:$M$109,cTABUI!$D$11:$D$109,B21),0)","v":0},{"$f":"IF(B21<>\"\",SUMIFS(cTABUI!$N$11:$N$109,cTABUI!$D$11:$D$109,B21),0)","v":0},{"$f":"IF(B21<>\"\",SUMIFS(cTABUI!$O$11:$O$109,cTABUI!$D$11:$D$109,B21),0)","v":0}]
[null,{"$f":"IF(iCONDOMINI!B22<>\"\",iCONDOMINI!B22,\"\")","v":"C12"},{"$f":"IF(iCONDOMINI!C22<>\"\",iCONDOMINI!C22,\"\")","v":""},{"$f":"IF(B22<>\"\",SUMIFS(cTABUI!$F$11:$F$109,cTABUI!$D$11:$D$109,B22),0)","v":0},{"$f":"IF(B22<>\"\",SUMIFS(cTABUI!$G$11:$G$109,cTABUI!$D$11:$D$109,B22),0)","v":0},{"$f":"IF(B22<>\"\",SUMIFS(cTABUI!$H$11:$H$109,cTABUI!$D$11:$D$109,B22),0)","v":0},{"$f":"IF(B22<>\"\",SUMIFS(cTABUI!$I$11:$I$109,cTABUI!$D$11:$D$109,B22),0)","v":0},{"$f":"IF(B22<>\"\",SUMIFS(cTABUI!$J$11:$J$109,cTABUI!$D$11:$D$109,B22),0)","v":0},{"$f":"IF(B22<>\"\",SUMIFS(cTABUI!$K$11:$K$109,cTABUI!$D$11:$D$109,B22),0)","v":0},{"$f":"IF(B22<>\"\",SUMIFS(cTABUI!$L$11:$L$109,cTABUI!$D$11:$D$109,B22),0)","v":0},{"$f":"IF(B22<>\"\",SUMIFS(cTABUI!$M$11:$M$109,cTABUI!$D$11:$D$109,B22),0)","v":0},{"$f":"IF(B22<>\"\",SUMIFS(cTABUI!$N$11:$N$109,cTABUI!$D$11:$D$109,B22),0)","v":0},{"$f":"IF(B22<>\"\",SUMIFS(cTABUI!$O$11:$O$109,cTABUI!$D$11:$D$109,B22),0)","v":0}]
[null,{"$f":"IF(iCONDOMINI!B23<>\"\",iCONDOMINI!B23,\"\")","v":"C13"},{"$f":"IF(iCONDOMINI!C23<>\"\",iCONDOMINI!C23,\"\")","v":""},{"$f":"IF(B23<>\"\",SUMIFS(cTABUI!$F$11:$F$109,cTABUI!$D$11:$D$109,B23),0)","v":0},{"$f":"IF(B23<>\"\",SUMIFS(cTABUI!$G$11:$G$109,cTABUI!$D$11:$D$109,B23),0)","v":0},{"$f":"IF(B23<>\"\",SUMIFS(cTABUI!$H$11:$H$109,cTABUI!$D$11:$D$109,B23),0)","v":0},{"$f":"IF(B23<>\"\",SUMIFS(cTABUI!$I$11:$I$109,cTABUI!$D$11:$D$109,B23),0)","v":0},{"$f":"IF(B23<>\"\",SUMIFS(cTABUI!$J$11:$J$109,cTABUI!$D$11:$D$109,B23),0)","v":0},{"$f":"IF(B23<>\"\",SUMIFS(cTABUI!$K$11:$K$109,cTABUI!$D$11:$D$109,B23),0)","v":0},{"$f":"IF(B23<>\"\",SUMIFS(cTABUI!$L$11:$L$109,cTABUI!$D$11:$D$109,B23),0)","v":0},{"$f":"IF(B23<>\"\",SUMIFS(cTABUI!$M$11:$M$109,cTABUI!$D$11:$D$109,B23),0)","v":0},{"$f":"IF(B23<>\"\",SUMIFS(cTABUI!$N$11:$N$109,cTABUI!$D$11:$D$109,B23),0)","v":0},{"$f":"IF(B23<>\"\",SUMIFS(cTABUI!$O$11:$O$109,cTABUI!$D$11:$D$109,B23),0)","v":0}]
[null,{"$f":"IF(iCONDOMINI!B24<>\"\",iCONDOMINI!B24,\"\")","v":"C14"},{"$f":"IF(iCONDOMINI!C24<>\"\",iCONDOMINI!C24,\"\")","v":""},{"$f":"IF(B24<>\"\",SUMIFS(cTABUI!$F$11:$F$109,cTABUI!$D$11:$D$109,B24),0)","v":0},{"$f":"IF(B24<>\"\",SUMIFS(cTABUI!$G$11:$G$109,cTABUI!$D$11:$D$109,B24),0)","v":0},{"$f":"IF(B24<>\"\",SUMIFS(cTABUI!$H$11:$H$109,cTABUI!$D$11:$D$109,B24),0)","v":0},{"$f":"IF(B24<>\"\",SUMIFS(cTABUI!$I$11:$I$109,cTABUI!$D$11:$D$109,B24),0)","v":0},{"$f":"IF(B24<>\"\",SUMIFS(cTABUI!$J$11:$J$109,cTABUI!$D$11:$D$109,B24),0)","v":0},{"$f":"IF(B24<>\"\",SUMIFS(cTABUI!$K$11:$K$109,cTABUI!$D$11:$D$109,B24),0)","v":0},{"$f":"IF(B24<>\"\",SUMIFS(cTABUI!$L$11:$L$109,cTABUI!$D$11:$D$109,B24),0)","v":0},{"$f":"IF(B24<>\"\",SUMIFS(cTABUI!$M$11:$M$109,cTABUI!$D$11:$D$109,B24),0)","v":0},{"$f":"IF(B24<>\"\",SUMIFS(cTABUI!$N$11:$N$109,cTABUI!$D$11:$D$109,B24),0)","v":0},{"$f":"IF(B24<>\"\",SUMIFS(cTABUI!$O$11:$O$109,cTABUI!$D$11:$D$109,B24),0)","v":0}]
[null,{"$f":"IF(iCONDOMINI!B25<>\"\",iCONDOMINI!B25,\"\")","v":"C15"},{"$f":"IF(iCONDOMINI!C25<>\"\",iCONDOMINI!C25,\"\")","v":""},{"$f":"IF(B25<>\"\",SUMIFS(cTABUI!$F$11:$F$109,cTABUI!$D$11:$D$109,B25),0)","v":0},{"$f":"IF(B25<>\"\",SUMIFS(cTABUI!$G$11:$G$109,cTABUI!$D$11:$D$109,B25),0)","v":0},{"$f":"IF(B25<>\"\",SUMIFS(cTABUI!$H$11:$H$109,cTABUI!$D$11:$D$109,B25),0)","v":0},{"$f":"IF(B25<>\"\",SUMIFS(cTABUI!$I$11:$I$109,cTABUI!$D$11:$D$109,B25),0)","v":0},{"$f":"IF(B25<>\"\",SUMIFS(cTABUI!$J$11:$J$109,cTABUI!$D$11:$D$109,B25),0)","v":0},{"$f":"IF(B25<>\"\",SUMIFS(cTABUI!$K$11:$K$109,cTABUI!$D$11:$D$109,B25),0)","v":0},{"$f":"IF(B25<>\"\",SUMIFS(cTABUI!$L$11:$L$109,cTABUI!$D$11:$D$109,B25),0)","v":0},{"$f":"IF(B25<>\"\",SUMIFS(cTABUI!$M$11:$M$109,cTABUI!$D$11:$D$109,B25),0)","v":0},{"$f":"IF(B25<>\"\",SUMIFS(cTABUI!$N$11:$N$109,cTABUI!$D$11:$D$109,B25),0)","v":0},{"$f":"IF(B25<>\"\",SUMIFS(cTABUI!$O$11:$O$109,cTABUI!$D$11:$D$109,B25),0)","v":0}]
[null,{"$f":"IF(iCONDOMINI!B26<>\"\",iCONDOMINI!B26,\"\")","v":"C16"},{"$f":"IF(iCONDOMINI!C26<>\"\",iCONDOMINI!C26,\"\")","v":""},{"$f":"IF(B26<>\"\",SUMIFS(cTABUI!$F$11:$F$109,cTABUI!$D$11:$D$109,B26),0)","v":0},{"$f":"IF(B26<>\"\",SUMIFS(cTABUI!$G$11:$G$109,cTABUI!$D$11:$D$109,B26),0)","v":0},{"$f":"IF(B26<>\"\",SUMIFS(cTABUI!$H$11:$H$109,cTABUI!$D$11:$D$109,B26),0)","v":0},{"$f":"IF(B26<>\"\",SUMIFS(cTABUI!$I$11:$I$109,cTABUI!$D$11:$D$109,B26),0)","v":0},{"$f":"IF(B26<>\"\",SUMIFS(cTABUI!$J$11:$J$109,cTABUI!$D$11:$D$109,B26),0)","v":0},{"$f":"IF(B26<>\"\",SUMIFS(cTABUI!$K$11:$K$109,cTABUI!$D$11:$D$109,B26),0)","v":0},{"$f":"IF(B26<>\"\",SUMIFS(cTABUI!$L$11:$L$109,cTABUI!$D$11:$D$109,B26),0)","v":0},{"$f":"IF(B26<>\"\",SUMIFS(cTABUI!$M$11:$M$109,cTABUI!$D$11:$D$109,B26),0)","v":0},{"$f":"IF(B26<>\"\",SUMIFS(cTABUI!$N$11:$N$109,cTABUI!$D$11:$D$109,B26),0)","v":0},{"$f":"IF(B26<>\"\",SUMIFS(cTABUI!$O$11:$O$109,cTABUI!$D$11:$D$109,B26),0)","v":0}]
[null,{"$f":"IF(iCONDOMINI!B27<>\"\",iCONDOMINI!B27,\"\")","v":"C17"},{"$f":"IF(iCONDOMINI!C27<>\"\",iCONDOMINI!C27,\"\")","v":""},{"$f":"IF(B27<>\"\",SUMIFS(cTABUI!$F$11:$F$109,cTABUI!$D$11:$D$109,B27),0)","v":0},{"$f":"IF(B27<>\"\",SUMIFS(cTABUI!$G$11:$G$109,cTABUI!$D$11:$D$109,B27),0)","v":0},{"$f":"IF(B27<>\"\",SUMIFS(cTABUI!$H$11:$H$109,cTABUI!$D$11:$D$109,B27),0)","v":0},{"$f":"IF(B27<>\"\",SUMIFS(cTABUI!$I$11:$I$109,cTABUI!$D$11:$D$109,B27),0)","v":0},{"$f":"IF(B27<>\"\",SUMIFS(cTABUI!$J$11:$J$109,cTABUI!$D$11:$D$109,B27),0)","v":0},{"$f":"IF(B27<>\"\",SUMIFS(cTABUI!$K$11:$K$109,cTABUI!$D$11:$D$109,B27),0)","v":0},{"$f":"IF(B27<>\"\",SUMIFS(cTABUI!$L$11:$L$109,cTABUI!$D$11:$D$109,B27),0)","v":0},{"$f":"IF(B27<>\"\",SUMIFS(cTABUI!$M$11:$M$109,cTABUI!$D$11:$D$109,B27),0)","v":0},{"$f":"IF(B27<>\"\",SUMIFS(cTABUI!$N$11:$N$109,cTABUI!$D$11:$D$109,B27),0)","v":0},{"$f":"IF(B27<>\"\",SUMIFS(cTABUI!$O$11:$O$109,cTABUI!$D$11:$D$109,B27),0)","v":0}]
[null,{"$f":"IF(iCONDOMINI!B28<>\"\",iCONDOMINI!B28,\"\")","v":"C18"},{"$f":"IF(iCONDOMINI!C28<>\"\",iCONDOMINI!C28,\"\")","v":""},{"$f":"IF(B28<>\"\",SUMIFS(cTABUI!$F$11:$F$109,cTABUI!$D$11:$D$109,B28),0)","v":0},{"$f":"IF(B28<>\"\",SUMIFS(cTABUI!$G$11:$G$109,cTABUI!$D$11:$D$109,B28),0)","v":0},{"$f":"IF(B28<>\"\",SUMIFS(cTABUI!$H$11:$H$109,cTABUI!$D$11:$D$109,B28),0)","v":0},{"$f":"IF(B28<>\"\",SUMIFS(cTABUI!$I$11:$I$109,cTABUI!$D$11:$D$109,B28),0)","v":0},{"$f":"IF(B28<>\"\",SUMIFS(cTABUI!$J$11:$J$109,cTABUI!$D$11:$D$109,B28),0)","v":0},{"$f":"IF(B28<>\"\",SUMIFS(cTABUI!$K$11:$K$109,cTABUI!$D$11:$D$109,B28),0)","v":0},{"$f":"IF(B28<>\"\",SUMIFS(cTABUI!$L$11:$L$109,cTABUI!$D$11:$D$109,B28),0)","v":0},{"$f":"IF(B28<>\"\",SUMIFS(cTABUI!$M$11:$M$109,cTABUI!$D$11:$D$109,B28),0)","v":0},{"$f":"IF(B28<>\"\",SUMIFS(cTABUI!$N$11:$N$109,cTABUI!$D$11:$D$109,B28),0)","v":0},{"$f":"IF(B28<>\"\",SUMIFS(cTABUI!$O$11:$O$109,cTABUI!$D$11:$D$109,B28),0)","v":0}]
[null,{"$f":"IF(iCONDOMINI!B29<>\"\",iCONDOMINI!B29,\"\")","v":"C19"},{"$f":"IF(iCONDOMINI!C29<>\"\",iCONDOMINI!C29,\"\")","v":""},{"$f":"IF(B29<>\"\",SUMIFS(cTABUI!$F$11:$F$109,cTABUI!$D$11:$D$109,B29),0)","v":0},{"$f":"IF(B29<>\"\",SUMIFS(cTABUI!$G$11:$G$109,cTABUI!$D$11:$D$109,B29),0)","v":0},{"$f":"IF(B29<>\"\",SUMIFS(cTABUI!$H$11:$H$109,cTABUI!$D$11:$D$109,B29),0)","v":0},{"$f":"IF(B29<>\"\",SUMIFS(cTABUI!$I$11:$I$109,cTABUI!$D$11:$D$109,B29),0)","v":0},{"$f":"IF(B29<>\"\",SUMIFS(cTABUI!$J$11:$J$109,cTABUI!$D$11:$D$109,B29),0)","v":0},{"$f":"IF(B29<>\"\",SUMIFS(cTABUI!$K$11:$K$109,cTABUI!$D$11:$D$109,B29),0)","v":0},{"$f":"IF(B29<>\"\",SUMIFS(cTABUI!$L$11:$L$109,cTABUI!$D$11:$D$109,B29),0)","v":0},{"$f":"IF(B29<>\"\",SUMIFS(cTABUI!$M$11:$M$109,cTABUI!$D$11:$D$109,B29),0)","v":0},{"$f":"IF(B29<>\"\",SUMIFS(cTABUI!$N$11:$N$109,cTABUI!$D$11:$D$109,B29),0)","v":0},{"$f":"IF(B29<>\"\",SUMIFS(cTABUI!$O$11:$O$109,cTABUI!$D$11:$D$109,B29),0)","v":0}]
[null,{"$f":"IF(iCONDOMINI!B30<>\"\",iCONDOMINI!B30,\"\")","v":"C20"},{"$f":"IF(iCONDOMINI!C30<>\"\",iCONDOMINI!C30,\"\")","v":""},{"$f":"IF(B30<>\"\",SUMIFS(cTABUI!$F$11:$F$109,cTABUI!$D$11:$D$109,B30),0)","v":0},{"$f":"IF(B30<>\"\",SUMIFS(cTABUI!$G$11:$G$109,cTABUI!$D$11:$D$109,B30),0)","v":0},{"$f":"IF(B30<>\"\",SUMIFS(cTABUI!$H$11:$H$109,cTABUI!$D$11:$D$109,B30),0)","v":0},{"$f":"IF(B30<>\"\",SUMIFS(cTABUI!$I$11:$I$109,cTABUI!$D$11:$D$109,B30),0)","v":0},{"$f":"IF(B30<>\"\",SUMIFS(cTABUI!$J$11:$J$109,cTABUI!$D$11:$D$109,B30),0)","v":0},{"$f":"IF(B30<>\"\",SUMIFS(cTABUI!$K$11:$K$109,cTABUI!$D$11:$D$109,B30),0)","v":0},{"$f":"IF(B30<>\"\",SUMIFS(cTABUI!$L$11:$L$109,cTABUI!$D$11:$D$109,B30),0)","v":0},{"$f":"IF(B30<>\"\",SUMIFS(cTABUI!$M$11:$M$109,cTABUI!$D$11:$D$109,B30),0)","v":0},{"$f":"IF(B30<>\"\",SUMIFS(cTABUI!$N$11:$N$109,cTABUI!$D$11:$D$109,B30),0)","v":0},{"$f":"IF(B30<>\"\",SUMIFS(cTABUI!$O$11:$O$109,cTABUI!$D$11:$D$109,B30),0)","v":0}]
[null,{"$f":"IF(iCONDOMINI!B31<>\"\",iCONDOMINI!B31,\"\")","v":"C21"},{"$f":"IF(iCONDOMINI!C31<>\"\",iCONDOMINI!C31,\"\")","v":""},{"$f":"IF(B31<>\"\",SUMIFS(cTABUI!$F$11:$F$109,cTABUI!$D$11:$D$109,B31),0)","v":0},{"$f":"IF(B31<>\"\",SUMIFS(cTABUI!$G$11:$G$109,cTABUI!$D$11:$D$109,B31),0)","v":0},{"$f":"IF(B31<>\"\",SUMIFS(cTABUI!$H$11:$H$109,cTABUI!$D$11:$D$109,B31),0)","v":0},{"$f":"IF(B31<>\"\",SUMIFS(cTABUI!$I$11:$I$109,cTABUI!$D$11:$D$109,B31),0)","v":0},{"$f":"IF(B31<>\"\",SUMIFS(cTABUI!$J$11:$J$109,cTABUI!$D$11:$D$109,B31),0)","v":0},{"$f":"IF(B31<>\"\",SUMIFS(cTABUI!$K$11:$K$109,cTABUI!$D$11:$D$109,B31),0)","v":0},{"$f":"IF(B31<>\"\",SUMIFS(cTABUI!$L$11:$L$109,cTABUI!$D$11:$D$109,B31),0)","v":0},{"$f":"IF(B31<>\"\",SUMIFS(cTABUI!$M$11:$M$109,cTABUI!$D$11:$D$109,B31),0)","v":0},{"$f":"IF(B31<>\"\",SUMIFS(cTABUI!$N$11:$N$109,cTABUI!$D$11:$D$109,B31),0)","v":0},{"$f":"IF(B31<>\"\",SUMIFS(cTABUI!$O$11:$O$109,cTABUI!$D$11:$D$109,B31),0)","v":0}]
[null,{"$f":"IF(iCONDOMINI!B32<>\"\",iCONDOMINI!B32,\"\")","v":"C22"},{"$f":"IF(iCONDOMINI!C32<>\"\",iCONDOMINI!C32,\"\")","v":""},{"$f":"IF(B32<>\"\",SUMIFS(cTABUI!$F$11:$F$109,cTABUI!$D$11:$D$109,B32),0)","v":0},{"$f":"IF(B32<>\"\",SUMIFS(cTABUI!$G$11:$G$109,cTABUI!$D$11:$D$109,B32),0)","v":0},{"$f":"IF(B32<>\"\",SUMIFS(cTABUI!$H$11:$H$109,cTABUI!$D$11:$D$109,B32),0)","v":0},{"$f":"IF(B32<>\"\",SUMIFS(cTABUI!$I$11:$I$109,cTABUI!$D$11:$D$109,B32),0)","v":0},{"$f":"IF(B32<>\"\",SUMIFS(cTABUI!$J$11:$J$109,cTABUI!$D$11:$D$109,B32),0)","v":0},{"$f":"IF(B32<>\"\",SUMIFS(cTABUI!$K$11:$K$109,cTABUI!$D$11:$D$109,B32),0)","v":0},{"$f":"IF(B32<>\"\",SUMIFS(cTABUI!$L$11:$L$109,cTABUI!$D$11:$D$109,B32),0)","v":0},{"$f":"IF(B32<>\"\",SUMIFS(cTABUI!$M$11:$M$109,cTABUI!$D$11:$D$109,B32),0)","v":0},{"$f":"IF(B32<>\"\",SUMIFS(cTABUI!$N$11:$N$109,cTABUI!$D$11:$D$109,B32),0)","v":0},{"$f":"IF(B32<>\"\",SUMIFS(cTABUI!$O$11:$O$109,cTABUI!$D$11:$D$109,B32),0)","v":0}]
[null,{"$f":"IF(iCONDOMINI!B33<>\"\",iCONDOMINI!B33,\"\")","v":"C23"},{"$f":"IF(iCONDOMINI!C33<>\"\",iCONDOMINI!C33,\"\")","v":""},{"$f":"IF(B33<>\"\",SUMIFS(cTABUI!$F$11:$F$109,cTABUI!$D$11:$D$109,B33),0)","v":0},{"$f":"IF(B33<>\"\",SUMIFS(cTABUI!$G$11:$G$109,cTABUI!$D$11:$D$109,B33),0)","v":0},{"$f":"IF(B33<>\"\",SUMIFS(cTABUI!$H$11:$H$109,cTABUI!$D$11:$D$109,B33),0)","v":0},{"$f":"IF(B33<>\"\",SUMIFS(cTABUI!$I$11:$I$109,cTABUI!$D$11:$D$109,B33),0)","v":0},{"$f":"IF(B33<>\"\",SUMIFS(cTABUI!$J$11:$J$109,cTABUI!$D$11:$D$109,B33),0)","v":0},{"$f":"IF(B33<>\"\",SUMIFS(cTABUI!$K$11:$K$109,cTABUI!$D$11:$D$109,B33),0)","v":0},{"$f":"IF(B33<>\"\",SUMIFS(cTABUI!$L$11:$L$109,cTABUI!$D$11:$D$109,B33),0)","v":0},{"$f":"IF(B33<>\"\",SUMIFS(cTABUI!$M$11:$M$109,cTABUI!$D$11:$D$109,B33),0)","v":0},{"$f":"IF(B33<>\"\",SUMIFS(cTABUI!$N$11:$N$109,cTABUI!$D$11:$D$109,B33),0)","v":0},{"$f":"IF(B33<>\"\",SUMIFS(cTABUI!$O$11:$O$109,cTABUI!$D$11:$D$109,B33),0)","v":0}]
[null,{"$f":"IF(iCONDOMINI!B34<>\"\",iCONDOMINI!B34,\"\")","v":"C24"},{"$f":"IF(iCONDOMINI!C34<>\"\",iCONDOMINI!C34,\"\")","v":""},{"$f":"IF(B34<>\"\",SUMIFS(cTABUI!$F$11:$F$109,cTABUI!$D$11:$D$109,B34),0)","v":0},{"$f":"IF(B34<>\"\",SUMIFS(cTABUI!$G$11:$G$109,cTABUI!$D$11:$D$109,B34),0)","v":0},{"$f":"IF(B34<>\"\",SUMIFS(cTABUI!$H$11:$H$109,cTABUI!$D$11:$D$109,B34),0)","v":0},{"$f":"IF(B34<>\"\",SUMIFS(cTABUI!$I$11:$I$109,cTABUI!$D$11:$D$109,B34),0)","v":0},{"$f":"IF(B34<>\"\",SUMIFS(cTABUI!$J$11:$J$109,cTABUI!$D$11:$D$109,B34),0)","v":0},{"$f":"IF(B34<>\"\",SUMIFS(cTABUI!$K$11:$K$109,cTABUI!$D$11:$D$109,B34),0)","v":0},{"$f":"IF(B34<>\"\",SUMIFS(cTABUI!$L$11:$L$109,cTABUI!$D$11:$D$109,B34),0)","v":0},{"$f":"IF(B34<>\"\",SUMIFS(cTABUI!$M$11:$M$109,cTABUI!$D$11:$D$109,B34),0)","v":0},{"$f":"IF(B34<>\"\",SUMIFS(cTABUI!$N$11:$N$109,cTABUI!$D$11:$D$109,B34),0)","v":0},{"$f":"IF(B34<>\"\",SUMIFS(cTABUI!$O$11:$O$109,cTABUI!$D$11:$D$109,B34),0)","v":0}]
[null,{"$f":"IF(iCONDOMINI!B35<>\"\",iCONDOMINI!B35,\"\")","v":"C25"},{"$f":"IF(iCONDOMINI!C35<>\"\",iCONDOMINI!C35,\"\")","v":""},{"$f":"IF(B35<>\"\",SUMIFS(cTABUI!$F$11:$F$109,cTABUI!$D$11:$D$109,B35),0)","v":0},{"$f":"IF(B35<>\"\",SUMIFS(cTABUI!$G$11:$G$109,cTABUI!$D$11:$D$109,B35),0)","v":0},{"$f":"IF(B35<>\"\",SUMIFS(cTABUI!$H$11:$H$109,cTABUI!$D$11:$D$109,B35),0)","v":0},{"$f":"IF(B35<>\"\",SUMIFS(cTABUI!$I$11:$I$109,cTABUI!$D$11:$D$109,B35),0)","v":0},{"$f":"IF(B35<>\"\",SUMIFS(cTABUI!$J$11:$J$109,cTABUI!$D$11:$D$109,B35),0)","v":0},{"$f":"IF(B35<>\"\",SUMIFS(cTABUI!$K$11:$K$109,cTABUI!$D$11:$D$109,B35),0)","v":0},{"$f":"IF(B35<>\"\",SUMIFS(cTABUI!$L$11:$L$109,cTABUI!$D$11:$D$109,B35),0)","v":0},{"$f":"IF(B35<>\"\",SUMIFS(cTABUI!$M$11:$M$109,cTABUI!$D$11:$D$109,B35),0)","v":0},{"$f":"IF(B35<>\"\",SUMIFS(cTABUI!$N$11:$N$109,cTABUI!$D$11:$D$109,B35),0)","v":0},{"$f":"IF(B35<>\"\",SUMIFS(cTABUI!$O$11:$O$109,cTABUI!$D$11:$D$109,B35),0)","v":0}]
[null,{"$f":"IF(iCONDOMINI!B36<>\"\",iCONDOMINI!B36,\"\")","v":"C26"},{"$f":"IF(iCONDOMINI!C36<>\"\",iCONDOMINI!C36,\"\")","v":""},{"$f":"IF(B36<>\"\",SUMIFS(cTABUI!$F$11:$F$109,cTABUI!$D$11:$D$109,B36),0)","v":0},{"$f":"IF(B36<>\"\",SUMIFS(cTABUI!$G$11:$G$109,cTABUI!$D$11:$D$109,B36),0)","v":0},{"$f":"IF(B36<>\"\",SUMIFS(cTABUI!$H$11:$H$109,cTABUI!$D$11:$D$109,B36),0)","v":0},{"$f":"IF(B36<>\"\",SUMIFS(cTABUI!$I$11:$I$109,cTABUI!$D$11:$D$109,B36),0)","v":0},{"$f":"IF(B36<>\"\",SUMIFS(cTABUI!$J$11:$J$109,cTABUI!$D$11:$D$109,B36),0)","v":0},{"$f":"IF(B36<>\"\",SUMIFS(cTABUI!$K$11:$K$109,cTABUI!$D$11:$D$109,B36),0)","v":0},{"$f":"IF(B36<>\"\",SUMIFS(cTABUI!$L$11:$L$109,cTABUI!$D$11:$D$109,B36),0)","v":0},{"$f":"IF(B36<>\"\",SUMIFS(cTABUI!$M$11:$M$109,cTABUI!$D$11:$D$109,B36),0)","v":0},{"$f":"IF(B36<>\"\",SUMIFS(cTABUI!$N$11:$N$109,cTABUI!$D$11:$D$109,B36),0)","v":0},{"$f":"IF(B36<>\"\",SUMIFS(cTABUI!$O$11:$O$109,cTABUI!$D$11:$D$109,B36),0)","v":0}]
[null,{"$f":"IF(iCONDOMINI!B37<>\"\",iCONDOMINI!B37,\"\")","v":"C27"},{"$f":"IF(iCONDOMINI!C37<>\"\",iCONDOMINI!C37,\"\")","v":""},{"$f":"IF(B37<>\"\",SUMIFS(cTABUI!$F$11:$F$109,cTABUI!$D$11:$D$109,B37),0)","v":0},{"$f":"IF(B37<>\"\",SUMIFS(cTABUI!$G$11:$G$109,cTABUI!$D$11:$D$109,B37),0)","v":0},{"$f":"IF(B37<>\"\",SUMIFS(cTABUI!$H$11:$H$109,cTABUI!$D$11:$D$109,B37),0)","v":0},{"$f":"IF(B37<>\"\",SUMIFS(cTABUI!$I$11:$I$109,cTABUI!$D$11:$D$109,B37),0)","v":0},{"$f":"IF(B37<>\"\",SUMIFS(cTABUI!$J$11:$J$109,cTABUI!$D$11:$D$109,B37),0)","v":0},{"$f":"IF(B37<>\"\",SUMIFS(cTABUI!$K$11:$K$109,cTABUI!$D$11:$D$109,B37),0)","v":0},{"$f":"IF(B37<>\"\",SUMIFS(cTABUI!$L$11:$L$109,cTABUI!$D$11:$D$109,B37),0)","v":0},{"$f":"IF(B37<>\"\",SUMIFS(cTABUI!$M$11:$M$109,cTABUI!$D$11:$D$109,B37),0)","v":0},{"$f":"IF(B37<>\"\",SUMIFS(cTABUI!$N$11:$N$109,cTABUI!$D$11:$D$109,B37),0)","v":0},{"$f":"IF(B37<>\"\",SUMIFS(cTABUI!$O$11:$O$109,cTABUI!$D$11:$D$109,B37),0)","v":0}]
[null,{"$f":"IF(iCONDOMINI!B38<>\"\",iCONDOMINI!B38,\"\")","v":"C28"},{"$f":"IF(iCONDOMINI!C38<>\"\",iCONDOMINI!C38,\"\")","v":""},{"$f":"IF(B38<>\"\",SUMIFS(cTABUI!$F$11:$F$109,cTABUI!$D$11:$D$109,B38),0)","v":0},{"$f":"IF(B38<>\"\",SUMIFS(cTABUI!$G$11:$G$109,cTABUI!$D$11:$D$109,B38),0)","v":0},{"$f":"IF(B38<>\"\",SUMIFS(cTABUI!$H$11:$H$109,cTABUI!$D$11:$D$109,B38),0)","v":0},{"$f":"IF(B38<>\"\",SUMIFS(cTABUI!$I$11:$I$109,cTABUI!$D$11:$D$109,B38),0)","v":0},{"$f":"IF(B38<>\"\",SUMIFS(cTABUI!$J$11:$J$109,cTABUI!$D$11:$D$109,B38),0)","v":0},{"$f":"IF(B38<>\"\",SUMIFS(cTABUI!$K$11:$K$109,cTABUI!$D$11:$D$109,B38),0)","v":0},{"$f":"IF(B38<>\"\",SUMIFS(cTABUI!$L$11:$L$109,cTABUI!$D$11:$D$109,B38),0)","v":0},{"$f":"IF(B38<>\"\",SUMIFS(cTABUI!$M$11:$M$109,cTABUI!$D$11:$D$109,B38),0)","v":0},{"$f":"IF(B38<>\"\",SUMIFS(cTABUI!$N$11:$N$109,cTABUI!$D$11:$D$109,B38),0)","v":0},{"$f":"IF(B38<>\"\",SUMIFS(cTABUI!$O$11:$O$109,cTABUI!$D$11:$D$109,B38),0)","v":0}]
[null,{"$f":"IF(iCONDOMINI!B39<>\"\",iCONDOMINI!B39,\"\")","v":"C29"},{"$f":"IF(iCONDOMINI!C39<>\"\",iCONDOMINI!C39,\"\")","v":""},{"$f":"IF(B39<>\"\",SUMIFS(cTABUI!$F$11:$F$109,cTABUI!$D$11:$D$109,B39),0)","v":0},{"$f":"IF(B39<>\"\",SUMIFS(cTABUI!$G$11:$G$109,cTABUI!$D$11:$D$109,B39),0)","v":0},{"$f":"IF(B39<>\"\",SUMIFS(cTABUI!$H$11:$H$109,cTABUI!$D$11:$D$109,B39),0)","v":0},{"$f":"IF(B39<>\"\",SUMIFS(cTABUI!$I$11:$I$109,cTABUI!$D$11:$D$109,B39),0)","v":0},{"$f":"IF(B39<>\"\",SUMIFS(cTABUI!$J$11:$J$109,cTABUI!$D$11:$D$109,B39),0)","v":0},{"$f":"IF(B39<>\"\",SUMIFS(cTABUI!$K$11:$K$109,cTABUI!$D$11:$D$109,B39),0)","v":0},{"$f":"IF(B39<>\"\",SUMIFS(cTABUI!$L$11:$L$109,cTABUI!$D$11:$D$109,B39),0)","v":0},{"$f":"IF(B39<>\"\",SUMIFS(cTABUI!$M$11:$M$109,cTABUI!$D$11:$D$109,B39),0)","v":0},{"$f":"IF(B39<>\"\",SUMIFS(cTABUI!$N$11:$N$109,cTABUI!$D$11:$D$109,B39),0)","v":0},{"$f":"IF(B39<>\"\",SUMIFS(cTABUI!$O$11:$O$109,cTABUI!$D$11:$D$109,B39),0)","v":0}]
[null,{"$f":"IF(iCONDOMINI!B40<>\"\",iCONDOMINI!B40,\"\")","v":"C30"},{"$f":"IF(iCONDOMINI!C40<>\"\",iCONDOMINI!C40,\"\")","v":""},{"$f":"IF(B40<>\"\",SUMIFS(cTABUI!$F$11:$F$109,cTABUI!$D$11:$D$109,B40),0)","v":0},{"$f":"IF(B40<>\"\",SUMIFS(cTABUI!$G$11:$G$109,cTABUI!$D$11:$D$109,B40),0)","v":0},{"$f":"IF(B40<>\"\",SUMIFS(cTABUI!$H$11:$H$109,cTABUI!$D$11:$D$109,B40),0)","v":0},{"$f":"IF(B40<>\"\",SUMIFS(cTABUI!$I$11:$I$109,cTABUI!$D$11:$D$109,B40),0)","v":0},{"$f":"IF(B40<>\"\",SUMIFS(cTABUI!$J$11:$J$109,cTABUI!$D$11:$D$109,B40),0)","v":0},{"$f":"IF(B40<>\"\",SUMIFS(cTABUI!$K$11:$K$109,cTABUI!$D$11:$D$109,B40),0)","v":0},{"$f":"IF(B40<>\"\",SUMIFS(cTABUI!$L$11:$L$109,cTABUI!$D$11:$D$109,B40),0)","v":0},{"$f":"IF(B40<>\"\",SUMIFS(cTABUI!$M$11:$M$109,cTABUI!$D$11:$D$109,B40),0)","v":0},{"$f":"IF(B40<>\"\",SUMIFS(cTABUI!$N$11:$N$109,cTABUI!$D$11:$D$109,B40),0)","v":0},{"$f":"IF(B40<>\"\",SUMIFS(cTABUI!$O$11:$O$109,cTABUI!$D$11:$D$109,B40),0)","v":0}]
[null,{"$f":"IF(iCONDOMINI!B41<>\"\",iCONDOMINI!B41,\"\")","v":"C31"},{"$f":"IF(iCONDOMINI!C41<>\"\",iCONDOMINI!C41,\"\")","v":""},{"$f":"IF(B41<>\"\",SUMIFS(cTABUI!$F$11:$F$109,cTABUI!$D$11:$D$109,B41),0)","v":0},{"$f":"IF(B41<>\"\",SUMIFS(cTABUI!$G$11:$G$109,cTABUI!$D$11:$D$109,B41),0)","v":0},{"$f":"IF(B41<>\"\",SUMIFS(cTABUI!$H$11:$H$109,cTABUI!$D$11:$D$109,B41),0)","v":0},{"$f":"IF(B41<>\"\",SUMIFS(cTABUI!$I$11:$I$109,cTABUI!$D$11:$D$109,B41),0)","v":0},{"$f":"IF(B41<>\"\",SUMIFS(cTABUI!$J$11:$J$109,cTABUI!$D$11:$D$109,B41),0)","v":0},{"$f":"IF(B41<>\"\",SUMIFS(cTABUI!$K$11:$K$109,cTABUI!$D$11:$D$109,B41),0)","v":0},{"$f":"IF(B41<>\"\",SUMIFS(cTABUI!$L$11:$L$109,cTABUI!$D$11:$D$109,B41),0)","v":0},{"$f":"IF(B41<>\"\",SUMIFS(cTABUI!$M$11:$M$109,cTABUI!$D$11:$D$109,B41),0)","v":0},{"$f":"IF(B41<>\"\",SUMIFS(cTABUI!$N$11:$N$109,cTABUI!$D$11:$D$109,B41),0)","v":0},{"$f":"IF(B41<>\"\",SUMIFS(cTABUI!$O$11:$O$109,cTABUI!$D$11:$D$109,B41),0)","v":0}]
[null,{"$f":"IF(iCONDOMINI!B42<>\"\",iCONDOMINI!B42,\"\")","v":"C32"},{"$f":"IF(iCONDOMINI!C42<>\"\",iCONDOMINI!C42,\"\")","v":""},{"$f":"IF(B42<>\"\",SUMIFS(cTABUI!$F$11:$F$109,cTABUI!$D$11:$D$109,B42),0)","v":0},{"$f":"IF(B42<>\"\",SUMIFS(cTABUI!$G$11:$G$109,cTABUI!$D$11:$D$109,B42),0)","v":0},{"$f":"IF(B42<>\"\",SUMIFS(cTABUI!$H$11:$H$109,cTABUI!$D$11:$D$109,B42),0)","v":0},{"$f":"IF(B42<>\"\",SUMIFS(cTABUI!$I$11:$I$109,cTABUI!$D$11:$D$109,B42),0)","v":0},{"$f":"IF(B42<>\"\",SUMIFS(cTABUI!$J$11:$J$109,cTABUI!$D$11:$D$109,B42),0)","v":0},{"$f":"IF(B42<>\"\",SUMIFS(cTABUI!$K$11:$K$109,cTABUI!$D$11:$D$109,B42),0)","v":0},{"$f":"IF(B42<>\"\",SUMIFS(cTABUI!$L$11:$L$109,cTABUI!$D$11:$D$109,B42),0)","v":0},{"$f":"IF(B42<>\"\",SUMIFS(cTABUI!$M$11:$M$109,cTABUI!$D$11:$D$109,B42),0)","v":0},{"$f":"IF(B42<>\"\",SUMIFS(cTABUI!$N$11:$N$109,cTABUI!$D$11:$D$109,B42),0)","v":0},{"$f":"IF(B42<>\"\",SUMIFS(cTABUI!$O$11:$O$109,cTABUI!$D$11:$D$109,B42),0)","v":0}]
[null,{"$f":"IF(iCONDOMINI!B43<>\"\",iCONDOMINI!B43,\"\")","v":"C33"},{"$f":"IF(iCONDOMINI!C43<>\"\",iCONDOMINI!C43,\"\")","v":""},{"$f":"IF(B43<>\"\",SUMIFS(cTABUI!$F$11:$F$109,cTABUI!$D$11:$D$109,B43),0)","v":0},{"$f":"IF(B43<>\"\",SUMIFS(cTABUI!$G$11:$G$109,cTABUI!$D$11:$D$109,B43),0)","v":0},{"$f":"IF(B43<>\"\",SUMIFS(cTABUI!$H$11:$H$109,cTABUI!$D$11:$D$109,B43),0)","v":0},{"$f":"IF(B43<>\"\",SUMIFS(cTABUI!$I$11:$I$109,cTABUI!$D$11:$D$109,B43),0)","v":0},{"$f":"IF(B43<>\"\",SUMIFS(cTABUI!$J$11:$J$109,cTABUI!$D$11:$D$109,B43),0)","v":0},{"$f":"IF(B43<>\"\",SUMIFS(cTABUI!$K$11:$K$109,cTABUI!$D$11:$D$109,B43),0)","v":0},{"$f":"IF(B43<>\"\",SUMIFS(cTABUI!$L$11:$L$109,cTABUI!$D$11:$D$109,B43),0)","v":0},{"$f":"IF(B43<>\"\",SUMIFS(cTABUI!$M$11:$M$109,cTABUI!$D$11:$D$109,B43),0)","v":0},{"$f":"IF(B43<>\"\",SUMIFS(cTABUI!$N$11:$N$109,cTABUI!$D$11:$D$109,B43),0)","v":0},{"$f":"IF(B43<>\"\",SUMIFS(cTABUI!$O$11:$O$109,cTABUI!$D$11:$D$109,B43),0)","v":0}]
[null,{"$f":"IF(iCONDOMINI!B44<>\"\",iCONDOMINI!B44,\"\")","v":"C34"},{"$f":"IF(iCONDOMINI!C44<>\"\",iCONDOMINI!C44,\"\")","v":""},{"$f":"IF(B44<>\"\",SUMIFS(cTABUI!$F$11:$F$109,cTABUI!$D$11:$D$109,B44),0)","v":0},{"$f":"IF(B44<>\"\",SUMIFS(cTABUI!$G$11:$G$109,cTABUI!$D$11:$D$109,B44),0)","v":0},{"$f":"IF(B44<>\"\",SUMIFS(cTABUI!$H$11:$H$109,cTABUI!$D$11:$D$109,B44),0)","v":0},{"$f":"IF(B44<>\"\",SUMIFS(cTABUI!$I$11:$I$109,cTABUI!$D$11:$D$109,B44),0)","v":0},{"$f":"IF(B44<>\"\",SUMIFS(cTABUI!$J$11:$J$109,cTABUI!$D$11:$D$109,B44),0)","v":0},{"$f":"IF(B44<>\"\",SUMIFS(cTABUI!$K$11:$K$109,cTABUI!$D$11:$D$109,B44),0)","v":0},{"$f":"IF(B44<>\"\",SUMIFS(cTABUI!$L$11:$L$109,cTABUI!$D$11:$D$109,B44),0)","v":0},{"$f":"IF(B44<>\"\",SUMIFS(cTABUI!$M$11:$M$109,cTABUI!$D$11:$D$109,B44),0)","v":0},{"$f":"IF(B44<>\"\",SUMIFS(cTABUI!$N$11:$N$109,cTABUI!$D$11:$D$109,B44),0)","v":0},{"$f":"IF(B44<>\"\",SUMIFS(cTABUI!$O$11:$O$109,cTABUI!$D$11:$D$109,B44),0)","v":0}]
[null,{"$f":"IF(iCONDOMINI!B45<>\"\",iCONDOMINI!B45,\"\")","v":"C35"},{"$f":"IF(iCONDOMINI!C45<>\"\",iCONDOMINI!C45,\"\")","v":""},{"$f":"IF(B45<>\"\",SUMIFS(cTABUI!$F$11:$F$109,cTABUI!$D$11:$D$109,B45),0)","v":0},{"$f":"IF(B45<>\"\",SUMIFS(cTABUI!$G$11:$G$109,cTABUI!$D$11:$D$109,B45),0)","v":0},{"$f":"IF(B45<>\"\",SUMIFS(cTABUI!$H$11:$H$109,cTABUI!$D$11:$D$109,B45),0)","v":0},{"$f":"IF(B45<>\"\",SUMIFS(cTABUI!$I$11:$I$109,cTABUI!$D$11:$D$109,B45),0)","v":0},{"$f":"IF(B45<>\"\",SUMIFS(cTABUI!$J$11:$J$109,cTABUI!$D$11:$D$109,B45),0)","v":0},{"$f":"IF(B45<>\"\",SUMIFS(cTABUI!$K$11:$K$109,cTABUI!$D$11:$D$109,B45),0)","v":0},{"$f":"IF(B45<>\"\",SUMIFS(cTABUI!$L$11:$L$109,cTABUI!$D$11:$D$109,B45),0)","v":0},{"$f":"IF(B45<>\"\",SUMIFS(cTABUI!$M$11:$M$109,cTABUI!$D$11:$D$109,B45),0)","v":0},{"$f":"IF(B45<>\"\",SUMIFS(cTABUI!$N$11:$N$109,cTABUI!$D$11:$D$109,B45),0)","v":0},{"$f":"IF(B45<>\"\",SUMIFS(cTABUI!$O$11:$O$109,cTABUI!$D$11:$D$109,B45),0)","v":0}]
[null,{"$f":"IF(iCONDOMINI!B46<>\"\",iCONDOMINI!B46,\"\")","v":"C36"},{"$f":"IF(iCONDOMINI!C46<>\"\",iCONDOMINI!C46,\"\")","v":""},{"$f":"IF(B46<>\"\",SUMIFS(cTABUI!$F$11:$F$109,cTABUI!$D$11:$D$109,B46),0)","v":0},{"$f":"IF(B46<>\"\",SUMIFS(cTABUI!$G$11:$G$109,cTABUI!$D$11:$D$109,B46),0)","v":0},{"$f":"IF(B46<>\"\",SUMIFS(cTABUI!$H$11:$H$109,cTABUI!$D$11:$D$109,B46),0)","v":0},{"$f":"IF(B46<>\"\",SUMIFS(cTABUI!$I$11:$I$109,cTABUI!$D$11:$D$109,B46),0)","v":0},{"$f":"IF(B46<>\"\",SUMIFS(cTABUI!$J$11:$J$109,cTABUI!$D$11:$D$109,B46),0)","v":0},{"$f":"IF(B46<>\"\",SUMIFS(cTABUI!$K$11:$K$109,cTABUI!$D$11:$D$109,B46),0)","v":0},{"$f":"IF(B46<>\"\",SUMIFS(cTABUI!$L$11:$L$109,cTABUI!$D$11:$D$109,B46),0)","v":0},{"$f":"IF(B46<>\"\",SUMIFS(cTABUI!$M$11:$M$109,cTABUI!$D$11:$D$109,B46),0)","v":0},{"$f":"IF(B46<>\"\",SUMIFS(cTABUI!$N$11:$N$109,cTABUI!$D$11:$D$109,B46),0)","v":0},{"$f":"IF(B46<>\"\",SUMIFS(cTABUI!$O$11:$O$109,cTABUI!$D$11:$D$109,B46),0)","v":0}]
[null,{"$f":"IF(iCONDOMINI!B47<>\"\",iCONDOMINI!B47,\"\")","v":"C37"},{"$f":"IF(iCONDOMINI!C47<>\"\",iCONDOMINI!C47,\"\")","v":""},{"$f":"IF(B47<>\"\",SUMIFS(cTABUI!$F$11:$F$109,cTABUI!$D$11:$D$109,B47),0)","v":0},{"$f":"IF(B47<>\"\",SUMIFS(cTABUI!$G$11:$G$109,cTABUI!$D$11:$D$109,B47),0)","v":0},{"$f":"IF(B47<>\"\",SUMIFS(cTABUI!$H$11:$H$109,cTABUI!$D$11:$D$109,B47),0)","v":0},{"$f":"IF(B47<>\"\",SUMIFS(cTABUI!$I$11:$I$109,cTABUI!$D$11:$D$109,B47),0)","v":0},{"$f":"IF(B47<>\"\",SUMIFS(cTABUI!$J$11:$J$109,cTABUI!$D$11:$D$109,B47),0)","v":0},{"$f":"IF(B47<>\"\",SUMIFS(cTABUI!$K$11:$K$109,cTABUI!$D$11:$D$109,B47),0)","v":0},{"$f":"IF(B47<>\"\",SUMIFS(cTABUI!$L$11:$L$109,cTABUI!$D$11:$D$109,B47),0)","v":0},{"$f":"IF(B47<>\"\",SUMIFS(cTABUI!$M$11:$M$109,cTABUI!$D$11:$D$109,B47),0)","v":0},{"$f":"IF(B47<>\"\",SUMIFS(cTABUI!$N$11:$N$109,cTABUI!$D$11:$D$109,B47),0)","v":0},{"$f":"IF(B47<>\"\",SUMIFS(cTABUI!$O$11:$O$109,cTABUI!$D$11:$D$109,B47),0)","v":0}]
[null,{"$f":"IF(iCONDOMINI!B48<>\"\",iCONDOMINI!B48,\"\")","v":"C38"},{"$f":"IF(iCONDOMINI!C48<>\"\",iCONDOMINI!C48,\"\")","v":""},{"$f":"IF(B48<>\"\",SUMIFS(cTABUI!$F$11:$F$109,cTABUI!$D$11:$D$109,B48),0)","v":0},{"$f":"IF(B48<>\"\",SUMIFS(cTABUI!$G$11:$G$109,cTABUI!$D$11:$D$109,B48),0)","v":0},{"$f":"IF(B48<>\"\",SUMIFS(cTABUI!$H$11:$H$109,cTABUI!$D$11:$D$109,B48),0)","v":0},{"$f":"IF(B48<>\"\",SUMIFS(cTABUI!$I$11:$I$109,cTABUI!$D$11:$D$109,B48),0)","v":0},{"$f":"IF(B48<>\"\",SUMIFS(cTABUI!$J$11:$J$109,cTABUI!$D$11:$D$109,B48),0)","v":0},{"$f":"IF(B48<>\"\",SUMIFS(cTABUI!$K$11:$K$109,cTABUI!$D$11:$D$109,B48),0)","v":0},{"$f":"IF(B48<>\"\",SUMIFS(cTABUI!$L$11:$L$109,cTABUI!$D$11:$D$109,B48),0)","v":0},{"$f":"IF(B48<>\"\",SUMIFS(cTABUI!$M$11:$M$109,cTABUI!$D$11:$D$109,B48),0)","v":0},{"$f":"IF(B48<>\"\",SUMIFS(cTABUI!$N$11:$N$109,cTABUI!$D$11:$D$109,B48),0)","v":0},{"$f":"IF(B48<>\"\",SUMIFS(cTABUI!$O$11:$O$109,cTABUI!$D$11:$D$109,B48),0)","v":0}]
[null,{"$f":"IF(iCONDOMINI!B49<>\"\",iCONDOMINI!B49,\"\")","v":"C39"},{"$f":"IF(iCONDOMINI!C49<>\"\",iCONDOMINI!C49,\"\")","v":""},{"$f":"IF(B49<>\"\",SUMIFS(cTABUI!$F$11:$F$109,cTABUI!$D$11:$D$109,B49),0)","v":0},{"$f":"IF(B49<>\"\",SUMIFS(cTABUI!$G$11:$G$109,cTABUI!$D$11:$D$109,B49),0)","v":0},{"$f":"IF(B49<>\"\",SUMIFS(cTABUI!$H$11:$H$109,cTABUI!$D$11:$D$109,B49),0)","v":0},{"$f":"IF(B49<>\"\",SUMIFS(cTABUI!$I$11:$I$109,cTABUI!$D$11:$D$109,B49),0)","v":0},{"$f":"IF(B49<>\"\",SUMIFS(cTABUI!$J$11:$J$109,cTABUI!$D$11:$D$109,B49),0)","v":0},{"$f":"IF(B49<>\"\",SUMIFS(cTABUI!$K$11:$K$109,cTABUI!$D$11:$D$109,B49),0)","v":0},{"$f":"IF(B49<>\"\",SUMIFS(cTABUI!$L$11:$L$109,cTABUI!$D$11:$D$109,B49),0)","v":0},{"$f":"IF(B49<>\"\",SUMIFS(cTABUI!$M$11:$M$109,cTABUI!$D$11:$D$109,B49),0)","v":0},{"$f":"IF(B49<>\"\",SUMIFS(cTABUI!$N$11:$N$109,cTABUI!$D$11:$D$109,B49),0)","v":0},{"$f":"IF(B49<>\"\",SUMIFS(cTABUI!$O$11:$O$109,cTABUI!$D$11:$D$109,B49),0)","v":0}]
[null,{"$f":"IF(iCONDOMINI!B50<>\"\",iCONDOMINI!B50,\"\")","v":"C40"},{"$f":"IF(iCONDOMINI!C50<>\"\",iCONDOMINI!C50,\"\")","v":""},{"$f":"IF(B50<>\"\",SUMIFS(cTABUI!$F$11:$F$109,cTABUI!$D$11:$D$109,B50),0)","v":0},{"$f":"IF(B50<>\"\",SUMIFS(cTABUI!$G$11:$G$109,cTABUI!$D$11:$D$109,B50),0)","v":0},{"$f":"IF(B50<>\"\",SUMIFS(cTABUI!$H$11:$H$109,cTABUI!$D$11:$D$109,B50),0)","v":0},{"$f":"IF(B50<>\"\",SUMIFS(cTABUI!$I$11:$I$109,cTABUI!$D$11:$D$109,B50),0)","v":0},{"$f":"IF(B50<>\"\",SUMIFS(cTABUI!$J$11:$J$109,cTABUI!$D$11:$D$109,B50),0)","v":0},{"$f":"IF(B50<>\"\",SUMIFS(cTABUI!$K$11:$K$109,cTABUI!$D$11:$D$109,B50),0)","v":0},{"$f":"IF(B50<>\"\",SUMIFS(cTABUI!$L$11:$L$109,cTABUI!$D$11:$D$109,B50),0)","v":0},{"$f":"IF(B50<>\"\",SUMIFS(cTABUI!$M$11:$M$109,cTABUI!$D$11:$D$109,B50),0)","v":0},{"$f":"IF(B50<>\"\",SUMIFS(cTABUI!$N$11:$N$109,cTABUI!$D$11:$D$109,B50),0)","v":0},{"$f":"IF(B50<>\"\",SUMIFS(cTABUI!$O$11:$O$109,cTABUI!$D$11:$D$109,B50),0)","v":0}]
[null,{"$f":"IF(iCONDOMINI!B51<>\"\",iCONDOMINI!B51,\"\")","v":"C41"},{"$f":"IF(iCONDOMINI!C51<>\"\",iCONDOMINI!C51,\"\")","v":""},{"$f":"IF(B51<>\"\",SUMIFS(cTABUI!$F$11:$F$109,cTABUI!$D$11:$D$109,B51),0)","v":0},{"$f":"IF(B51<>\"\",SUMIFS(cTABUI!$G$11:$G$109,cTABUI!$D$11:$D$109,B51),0)","v":0},{"$f":"IF(B51<>\"\",SUMIFS(cTABUI!$H$11:$H$109,cTABUI!$D$11:$D$109,B51),0)","v":0},{"$f":"IF(B51<>\"\",SUMIFS(cTABUI!$I$11:$I$109,cTABUI!$D$11:$D$109,B51),0)","v":0},{"$f":"IF(B51<>\"\",SUMIFS(cTABUI!$J$11:$J$109,cTABUI!$D$11:$D$109,B51),0)","v":0},{"$f":"IF(B51<>\"\",SUMIFS(cTABUI!$K$11:$K$109,cTABUI!$D$11:$D$109,B51),0)","v":0},{"$f":"IF(B51<>\"\",SUMIFS(cTABUI!$L$11:$L$109,cTABUI!$D$11:$D$109,B51),0)","v":0},{"$f":"IF(B51<>\"\",SUMIFS(cTABUI!$M$11:$M$109,cTABUI!$D$11:$D$109,B51),0)","v":0},{"$f":"IF(B51<>\"\",SUMIFS(cTABUI!$N$11:$N$109,cTABUI!$D$11:$D$109,B51),0)","v":0},{"$f":"IF(B51<>\"\",SUMIFS(cTABUI!$O$11:$O$109,cTABUI!$D$11:$D$109,B51),0)","v":0}]
[null,{"$f":"IF(iCONDOMINI!B52<>\"\",iCONDOMINI!B52,\"\")","v":"C42"},{"$f":"IF(iCONDOMINI!C52<>\"\",iCONDOMINI!C52,\"\")","v":""},{"$f":"IF(B52<>\"\",SUMIFS(cTABUI!$F$11:$F$109,cTABUI!$D$11:$D$109,B52),0)","v":0},{"$f":"IF(B52<>\"\",SUMIFS(cTABUI!$G$11:$G$109,cTABUI!$D$11:$D$109,B52),0)","v":0},{"$f":"IF(B52<>\"\",SUMIFS(cTABUI!$H$11:$H$109,cTABUI!$D$11:$D$109,B52),0)","v":0},{"$f":"IF(B52<>\"\",SUMIFS(cTABUI!$I$11:$I$109,cTABUI!$D$11:$D$109,B52),0)","v":0},{"$f":"IF(B52<>\"\",SUMIFS(cTABUI!$J$11:$J$109,cTABUI!$D$11:$D$109,B52),0)","v":0},{"$f":"IF(B52<>\"\",SUMIFS(cTABUI!$K$11:$K$109,cTABUI!$D$11:$D$109,B52),0)","v":0},{"$f":"IF(B52<>\"\",SUMIFS(cTABUI!$L$11:$L$109,cTABUI!$D$11:$D$109,B52),0)","v":0},{"$f":"IF(B52<>\"\",SUMIFS(cTABUI!$M$11:$M$109,cTABUI!$D$11:$D$109,B52),0)","v":0},{"$f":"IF(B52<>\"\",SUMIFS(cTABUI!$N$11:$N$109,cTABUI!$D$11:$D$109,B52),0)","v":0},{"$f":"IF(B52<>\"\",SUMIFS(cTABUI!$O$11:$O$109,cTABUI!$D$11:$D$109,B52),0)","v":0}]
[null,{"$f":"IF(iCONDOMINI!B53<>\"\",iCONDOMINI!B53,\"\")","v":"C43"},{"$f":"IF(iCONDOMINI!C53<>\"\",iCONDOMINI!C53,\"\")","v":""},{"$f":"IF(B53<>\"\",SUMIFS(cTABUI!$F$11:$F$109,cTABUI!$D$11:$D$109,B53),0)","v":0},{"$f":"IF(B53<>\"\",SUMIFS(cTABUI!$G$11:$G$109,cTABUI!$D$11:$D$109,B53),0)","v":0},{"$f":"IF(B53<>\"\",SUMIFS(cTABUI!$H$11:$H$109,cTABUI!$D$11:$D$109,B53),0)","v":0},{"$f":"IF(B53<>\"\",SUMIFS(cTABUI!$I$11:$I$109,cTABUI!$D$11:$D$109,B53),0)","v":0},{"$f":"IF(B53<>\"\",SUMIFS(cTABUI!$J$11:$J$109,cTABUI!$D$11:$D$109,B53),0)","v":0},{"$f":"IF(B53<>\"\",SUMIFS(cTABUI!$K$11:$K$109,cTABUI!$D$11:$D$109,B53),0)","v":0},{"$f":"IF(B53<>\"\",SUMIFS(cTABUI!$L$11:$L$109,cTABUI!$D$11:$D$109,B53),0)","v":0},{"$f":"IF(B53<>\"\",SUMIFS(cTABUI!$M$11:$M$109,cTABUI!$D$11:$D$109,B53),0)","v":0},{"$f":"IF(B53<>\"\",SUMIFS(cTABUI!$N$11:$N$109,cTABUI!$D$11:$D$109,B53),0)","v":0},{"$f":"IF(B53<>\"\",SUMIFS(cTABUI!$O$11:$O$109,cTABUI!$D$11:$D$109,B53),0)","v":0}]
[null,{"$f":"IF(iCONDOMINI!B54<>\"\",iCONDOMINI!B54,\"\")","v":"C44"},{"$f":"IF(iCONDOMINI!C54<>\"\",iCONDOMINI!C54,\"\")","v":""},{"$f":"IF(B54<>\"\",SUMIFS(cTABUI!$F$11:$F$109,cTABUI!$D$11:$D$109,B54),0)","v":0},{"$f":"IF(B54<>\"\",SUMIFS(cTABUI!$G$11:$G$109,cTABUI!$D$11:$D$109,B54),0)","v":0},{"$f":"IF(B54<>\"\",SUMIFS(cTABUI!$H$11:$H$109,cTABUI!$D$11:$D$109,B54),0)","v":0},{"$f":"IF(B54<>\"\",SUMIFS(cTABUI!$I$11:$I$109,cTABUI!$D$11:$D$109,B54),0)","v":0},{"$f":"IF(B54<>\"\",SUMIFS(cTABUI!$J$11:$J$109,cTABUI!$D$11:$D$109,B54),0)","v":0},{"$f":"IF(B54<>\"\",SUMIFS(cTABUI!$K$11:$K$109,cTABUI!$D$11:$D$109,B54),0)","v":0},{"$f":"IF(B54<>\"\",SUMIFS(cTABUI!$L$11:$L$109,cTABUI!$D$11:$D$109,B54),0)","v":0},{"$f":"IF(B54<>\"\",SUMIFS(cTABUI!$M$11:$M$109,cTABUI!$D$11:$D$109,B54),0)","v":0},{"$f":"IF(B54<>\"\",SUMIFS(cTABUI!$N$11:$N$109,cTABUI!$D$11:$D$109,B54),0)","v":0},{"$f":"IF(B54<>\"\",SUMIFS(cTABUI!$O$11:$O$109,cTABUI!$D$11:$D$109,B54),0)","v":0}]
[null,{"$f":"IF(iCONDOMINI!B55<>\"\",iCONDOMINI!B55,\"\")","v":"C45"},{"$f":"IF(iCONDOMINI!C55<>\"\",iCONDOMINI!C55,\"\")","v":""},{"$f":"IF(B55<>\"\",SUMIFS(cTABUI!$F$11:$F$109,cTABUI!$D$11:$D$109,B55),0)","v":0},{"$f":"IF(B55<>\"\",SUMIFS(cTABUI!$G$11:$G$109,cTABUI!$D$11:$D$109,B55),0)","v":0},{"$f":"IF(B55<>\"\",SUMIFS(cTABUI!$H$11:$H$109,cTABUI!$D$11:$D$109,B55),0)","v":0},{"$f":"IF(B55<>\"\",SUMIFS(cTABUI!$I$11:$I$109,cTABUI!$D$11:$D$109,B55),0)","v":0},{"$f":"IF(B55<>\"\",SUMIFS(cTABUI!$J$11:$J$109,cTABUI!$D$11:$D$109,B55),0)","v":0},{"$f":"IF(B55<>\"\",SUMIFS(cTABUI!$K$11:$K$109,cTABUI!$D$11:$D$109,B55),0)","v":0},{"$f":"IF(B55<>\"\",SUMIFS(cTABUI!$L$11:$L$109,cTABUI!$D$11:$D$109,B55),0)","v":0},{"$f":"IF(B55<>\"\",SUMIFS(cTABUI!$M$11:$M$109,cTABUI!$D$11:$D$109,B55),0)","v":0},{"$f":"IF(B55<>\"\",SUMIFS(cTABUI!$N$11:$N$109,cTABUI!$D$11:$D$109,B55),0)","v":0},{"$f":"IF(B55<>\"\",SUMIFS(cTABUI!$O$11:$O$109,cTABUI!$D$11:$D$109,B55),0)","v":0}]
[null,{"$f":"IF(iCONDOMINI!B56<>\"\",iCONDOMINI!B56,\"\")","v":"C46"},{"$f":"IF(iCONDOMINI!C56<>\"\",iCONDOMINI!C56,\"\")","v":""},{"$f":"IF(B56<>\"\",SUMIFS(cTABUI!$F$11:$F$109,cTABUI!$D$11:$D$109,B56),0)","v":0},{"$f":"IF(B56<>\"\",SUMIFS(cTABUI!$G$11:$G$109,cTABUI!$D$11:$D$109,B56),0)","v":0},{"$f":"IF(B56<>\"\",SUMIFS(cTABUI!$H$11:$H$109,cTABUI!$D$11:$D$109,B56),0)","v":0},{"$f":"IF(B56<>\"\",SUMIFS(cTABUI!$I$11:$I$109,cTABUI!$D$11:$D$109,B56),0)","v":0},{"$f":"IF(B56<>\"\",SUMIFS(cTABUI!$J$11:$J$109,cTABUI!$D$11:$D$109,B56),0)","v":0},{"$f":"IF(B56<>\"\",SUMIFS(cTABUI!$K$11:$K$109,cTABUI!$D$11:$D$109,B56),0)","v":0},{"$f":"IF(B56<>\"\",SUMIFS(cTABUI!$L$11:$L$109,cTABUI!$D$11:$D$109,B56),0)","v":0},{"$f":"IF(B56<>\"\",SUMIFS(cTABUI!$M$11:$M$109,cTABUI!$D$11:$D$109,B56),0)","v":0},{"$f":"IF(B56<>\"\",SUMIFS(cTABUI!$N$11:$N$109,cTABUI!$D$11:$D$109,B56),0)","v":0},{"$f":"IF(B56<>\"\",SUMIFS(cTABUI!$O$11:$O$109,cTABUI!$D$11:$D$109,B56),0)","v":0}]
[null,{"$f":"IF(iCONDOMINI!B57<>\"\",iCONDOMINI!B57,\"\")","v":"C47"},{"$f":"IF(iCONDOMINI!C57<>\"\",iCONDOMINI!C57,\"\")","v":""},{"$f":"IF(B57<>\"\",SUMIFS(cTABUI!$F$11:$F$109,cTABUI!$D$11:$D$109,B57),0)","v":0},{"$f":"IF(B57<>\"\",SUMIFS(cTABUI!$G$11:$G$109,cTABUI!$D$11:$D$109,B57),0)","v":0},{"$f":"IF(B57<>\"\",SUMIFS(cTABUI!$H$11:$H$109,cTABUI!$D$11:$D$109,B57),0)","v":0},{"$f":"IF(B57<>\"\",SUMIFS(cTABUI!$I$11:$I$109,cTABUI!$D$11:$D$109,B57),0)","v":0},{"$f":"IF(B57<>\"\",SUMIFS(cTABUI!$J$11:$J$109,cTABUI!$D$11:$D$109,B57),0)","v":0},{"$f":"IF(B57<>\"\",SUMIFS(cTABUI!$K$11:$K$109,cTABUI!$D$11:$D$109,B57),0)","v":0},{"$f":"IF(B57<>\"\",SUMIFS(cTABUI!$L$11:$L$109,cTABUI!$D$11:$D$109,B57),0)","v":0},{"$f":"IF(B57<>\"\",SUMIFS(cTABUI!$M$11:$M$109,cTABUI!$D$11:$D$109,B57),0)","v":0},{"$f":"IF(B57<>\"\",SUMIFS(cTABUI!$N$11:$N$109,cTABUI!$D$11:$D$109,B57),0)","v":0},{"$f":"IF(B57<>\"\",SUMIFS(cTABUI!$O$11:$O$109,cTABUI!$D$11:$D$109,B57),0)","v":0}]
[null,{"$f":"IF(iCONDOMINI!B58<>\"\",iCONDOMINI!B58,\"\")","v":"C48"},{"$f":"IF(iCONDOMINI!C58<>\"\",iCONDOMINI!C58,\"\")","v":""},{"$f":"IF(B58<>\"\",SUMIFS(cTABUI!$F$11:$F$109,cTABUI!$D$11:$D$109,B58),0)","v":0},{"$f":"IF(B58<>\"\",SUMIFS(cTABUI!$G$11:$G$109,cTABUI!$D$11:$D$109,B58),0)","v":0},{"$f":"IF(B58<>\"\",SUMIFS(cTABUI!$H$11:$H$109,cTABUI!$D$11:$D$109,B58),0)","v":0},{"$f":"IF(B58<>\"\",SUMIFS(cTABUI!$I$11:$I$109,cTABUI!$D$11:$D$109,B58),0)","v":0},{"$f":"IF(B58<>\"\",SUMIFS(cTABUI!$J$11:$J$109,cTABUI!$D$11:$D$109,B58),0)","v":0},{"$f":"IF(B58<>\"\",SUMIFS(cTABUI!$K$11:$K$109,cTABUI!$D$11:$D$109,B58),0)","v":0},{"$f":"IF(B58<>\"\",SUMIFS(cTABUI!$L$11:$L$109,cTABUI!$D$11:$D$109,B58),0)","v":0},{"$f":"IF(B58<>\"\",SUMIFS(cTABUI!$M$11:$M$109,cTABUI!$D$11:$D$109,B58),0)","v":0},{"$f":"IF(B58<>\"\",SUMIFS(cTABUI!$N$11:$N$109,cTABUI!$D$11:$D$109,B58),0)","v":0},{"$f":"IF(B58<>\"\",SUMIFS(cTABUI!$O$11:$O$109,cTABUI!$D$11:$D$109,B58),0)","v":0}]
[null,{"$f":"IF(iCONDOMINI!B59<>\"\",iCONDOMINI!B59,\"\")","v":"C49"},{"$f":"IF(iCONDOMINI!C59<>\"\",iCONDOMINI!C59,\"\")","v":""},{"$f":"IF(B59<>\"\",SUMIFS(cTABUI!$F$11:$F$109,cTABUI!$D$11:$D$109,B59),0)","v":0},{"$f":"IF(B59<>\"\",SUMIFS(cTABUI!$G$11:$G$109,cTABUI!$D$11:$D$109,B59),0)","v":0},{"$f":"IF(B59<>\"\",SUMIFS(cTABUI!$H$11:$H$109,cTABUI!$D$11:$D$109,B59),0)","v":0},{"$f":"IF(B59<>\"\",SUMIFS(cTABUI!$I$11:$I$109,cTABUI!$D$11:$D$109,B59),0)","v":0},{"$f":"IF(B59<>\"\",SUMIFS(cTABUI!$J$11:$J$109,cTABUI!$D$11:$D$109,B59),0)","v":0},{"$f":"IF(B59<>\"\",SUMIFS(cTABUI!$K$11:$K$109,cTABUI!$D$11:$D$109,B59),0)","v":0},{"$f":"IF(B59<>\"\",SUMIFS(cTABUI!$L$11:$L$109,cTABUI!$D$11:$D$109,B59),0)","v":0},{"$f":"IF(B59<>\"\",SUMIFS(cTABUI!$M$11:$M$109,cTABUI!$D$11:$D$109,B59),0)","v":0},{"$f":"IF(B59<>\"\",SUMIFS(cTABUI!$N$11:$N$109,cTABUI!$D$11:$D$109,B59),0)","v":0},{"$f":"IF(B59<>\"\",SUMIFS(cTABUI!$O$11:$O$109,cTABUI!$D$11:$D$109,B59),0)","v":0}]
[null,{"$f":"IF(iCONDOMINI!B60<>\"\",iCONDOMINI!B60,\"\")","v":"C50"},{"$f":"IF(iCONDOMINI!C60<>\"\",iCONDOMINI!C60,\"\")","v":""},{"$f":"IF(B60<>\"\",SUMIFS(cTABUI!$F$11:$F$109,cTABUI!$D$11:$D$109,B60),0)","v":0},{"$f":"IF(B60<>\"\",SUMIFS(cTABUI!$G$11:$G$109,cTABUI!$D$11:$D$109,B60),0)","v":0},{"$f":"IF(B60<>\"\",SUMIFS(cTABUI!$H$11:$H$109,cTABUI!$D$11:$D$109,B60),0)","v":0},{"$f":"IF(B60<>\"\",SUMIFS(cTABUI!$I$11:$I$109,cTABUI!$D$11:$D$109,B60),0)","v":0},{"$f":"IF(B60<>\"\",SUMIFS(cTABUI!$J$11:$J$109,cTABUI!$D$11:$D$109,B60),0)","v":0},{"$f":"IF(B60<>\"\",SUMIFS(cTABUI!$K$11:$K$109,cTABUI!$D$11:$D$109,B60),0)","v":0},{"$f":"IF(B60<>\"\",SUMIFS(cTABUI!$L$11:$L$109,cTABUI!$D$11:$D$109,B60),0)","v":0},{"$f":"IF(B60<>\"\",SUMIFS(cTABUI!$M$11:$M$109,cTABUI!$D$11:$D$109,B60),0)","v":0},{"$f":"IF(B60<>\"\",SUMIFS(cTABUI!$N$11:$N$109,cTABUI!$D$11:$D$109,B60),0)","v":0},{"$f":"IF(B60<>\"\",SUMIFS(cTABUI!$O$11:$O$109,cTABUI!$D$11:$D$109,B60),0)","v":0}]
[null,{"$f":"IF(iCONDOMINI!B61<>\"\",iCONDOMINI!B61,\"\")","v":"C51"},{"$f":"IF(iCONDOMINI!C61<>\"\",iCONDOMINI!C61,\"\")","v":""},{"$f":"IF(B61<>\"\",SUMIFS(cTABUI!$F$11:$F$109,cTABUI!$D$11:$D$109,B61),0)","v":0},{"$f":"IF(B61<>\"\",SUMIFS(cTABUI!$G$11:$G$109,cTABUI!$D$11:$D$109,B61),0)","v":0},{"$f":"IF(B61<>\"\",SUMIFS(cTABUI!$H$11:$H$109,cTABUI!$D$11:$D$109,B61),0)","v":0},{"$f":"IF(B61<>\"\",SUMIFS(cTABUI!$I$11:$I$109,cTABUI!$D$11:$D$109,B61),0)","v":0},{"$f":"IF(B61<>\"\",SUMIFS(cTABUI!$J$11:$J$109,cTABUI!$D$11:$D$109,B61),0)","v":0},{"$f":"IF(B61<>\"\",SUMIFS(cTABUI!$K$11:$K$109,cTABUI!$D$11:$D$109,B61),0)","v":0},{"$f":"IF(B61<>\"\",SUMIFS(cTABUI!$L$11:$L$109,cTABUI!$D$11:$D$109,B61),0)","v":0},{"$f":"IF(B61<>\"\",SUMIFS(cTABUI!$M$11:$M$109,cTABUI!$D$11:$D$109,B61),0)","v":0},{"$f":"IF(B61<>\"\",SUMIFS(cTABUI!$N$11:$N$109,cTABUI!$D$11:$D$109,B61),0)","v":0},{"$f":"IF(B61<>\"\",SUMIFS(cTABUI!$O$11:$O$109,cTABUI!$D$11:$D$109,B61),0)","v":0}]
[null,{"$f":"IF(iCONDOMINI!B62<>\"\",iCONDOMINI!B62,\"\")","v":"C52"},{"$f":"IF(iCONDOMINI!C62<>\"\",iCONDOMINI!C62,\"\")","v":""},{"$f":"IF(B62<>\"\",SUMIFS(cTABUI!$F$11:$F$109,cTABUI!$D$11:$D$109,B62),0)","v":0},{"$f":"IF(B62<>\"\",SUMIFS(cTABUI!$G$11:$G$109,cTABUI!$D$11:$D$109,B62),0)","v":0},{"$f":"IF(B62<>\"\",SUMIFS(cTABUI!$H$11:$H$109,cTABUI!$D$11:$D$109,B62),0)","v":0},{"$f":"IF(B62<>\"\",SUMIFS(cTABUI!$I$11:$I$109,cTABUI!$D$11:$D$109,B62),0)","v":0},{"$f":"IF(B62<>\"\",SUMIFS(cTABUI!$J$11:$J$109,cTABUI!$D$11:$D$109,B62),0)","v":0},{"$f":"IF(B62<>\"\",SUMIFS(cTABUI!$K$11:$K$109,cTABUI!$D$11:$D$109,B62),0)","v":0},{"$f":"IF(B62<>\"\",SUMIFS(cTABUI!$L$11:$L$109,cTABUI!$D$11:$D$109,B62),0)","v":0},{"$f":"IF(B62<>\"\",SUMIFS(cTABUI!$M$11:$M$109,cTABUI!$D$11:$D$109,B62),0)","v":0},{"$f":"IF(B62<>\"\",SUMIFS(cTABUI!$N$11:$N$109,cTABUI!$D$11:$D$109,B62),0)","v":0},{"$f":"IF(B62<>\"\",SUMIFS(cTABUI!$O$11:$O$109,cTABUI!$D$11:$D$109,B62),0)","v":0}]
[null,{"$f":"IF(iCONDOMINI!B63<>\"\",iCONDOMINI!B63,\"\")","v":"C53"},{"$f":"IF(iCONDOMINI!C63<>\"\",iCONDOMINI!C63,\"\")","v":""},{"$f":"IF(B63<>\"\",SUMIFS(cTABUI!$F$11:$F$109,cTABUI!$D$11:$D$109,B63),0)","v":0},{"$f":"IF(B63<>\"\",SUMIFS(cTABUI!$G$11:$G$109,cTABUI!$D$11:$D$109,B63),0)","v":0},{"$f":"IF(B63<>\"\",SUMIFS(cTABUI!$H$11:$H$109,cTABUI!$D$11:$D$109,B63),0)","v":0},{"$f":"IF(B63<>\"\",SUMIFS(cTABUI!$I$11:$I$109,cTABUI!$D$11:$D$109,B63),0)","v":0},{"$f":"IF(B63<>\"\",SUMIFS(cTABUI!$J$11:$J$109,cTABUI!$D$11:$D$109,B63),0)","v":0},{"$f":"IF(B63<>\"\",SUMIFS(cTABUI!$K$11:$K$109,cTABUI!$D$11:$D$109,B63),0)","v":0},{"$f":"IF(B63<>\"\",SUMIFS(cTABUI!$L$11:$L$109,cTABUI!$D$11:$D$109,B63),0)","v":0},{"$f":"IF(B63<>\"\",SUMIFS(cTABUI!$M$11:$M$109,cTABUI!$D$11:$D$109,B63),0)","v":0},{"$f":"IF(B63<>\"\",SUMIFS(cTABUI!$N$11:$N$109,cTABUI!$D$11:$D$109,B63),0)","v":0},{"$f":"IF(B63<>\"\",SUMIFS(cTABUI!$O$11:$O$109,cTABUI!$D$11:$D$109,B63),0)","v":0}]
[null,{"$f":"IF(iCONDOMINI!B64<>\"\",iCONDOMINI!B64,\"\")","v":"C54"},{"$f":"IF(iCONDOMINI!C64<>\"\",iCONDOMINI!C64,\"\")","v":""},{"$f":"IF(B64<>\"\",SUMIFS(cTABUI!$F$11:$F$109,cTABUI!$D$11:$D$109,B64),0)","v":0},{"$f":"IF(B64<>\"\",SUMIFS(cTABUI!$G$11:$G$109,cTABUI!$D$11:$D$109,B64),0)","v":0},{"$f":"IF(B64<>\"\",SUMIFS(cTABUI!$H$11:$H$109,cTABUI!$D$11:$D$109,B64),0)","v":0},{"$f":"IF(B64<>\"\",SUMIFS(cTABUI!$I$11:$I$109,cTABUI!$D$11:$D$109,B64),0)","v":0},{"$f":"IF(B64<>\"\",SUMIFS(cTABUI!$J$11:$J$109,cTABUI!$D$11:$D$109,B64),0)","v":0},{"$f":"IF(B64<>\"\",SUMIFS(cTABUI!$K$11:$K$109,cTABUI!$D$11:$D$109,B64),0)","v":0},{"$f":"IF(B64<>\"\",SUMIFS(cTABUI!$L$11:$L$109,cTABUI!$D$11:$D$109,B64),0)","v":0},{"$f":"IF(B64<>\"\",SUMIFS(cTABUI!$M$11:$M$109,cTABUI!$D$11:$D$109,B64),0)","v":0},{"$f":"IF(B64<>\"\",SUMIFS(cTABUI!$N$11:$N$109,cTABUI!$D$11:$D$109,B64),0)","v":0},{"$f":"IF(B64<>\"\",SUMIFS(cTABUI!$O$11:$O$109,cTABUI!$D$11:$D$109,B64),0)","v":0}]
[null,{"$f":"IF(iCONDOMINI!B65<>\"\",iCONDOMINI!B65,\"\")","v":"C55"},{"$f":"IF(iCONDOMINI!C65<>\"\",iCONDOMINI!C65,\"\")","v":""},{"$f":"IF(B65<>\"\",SUMIFS(cTABUI!$F$11:$F$109,cTABUI!$D$11:$D$109,B65),0)","v":0},{"$f":"IF(B65<>\"\",SUMIFS(cTABUI!$G$11:$G$109,cTABUI!$D$11:$D$109,B65),0)","v":0},{"$f":"IF(B65<>\"\",SUMIFS(cTABUI!$H$11:$H$109,cTABUI!$D$11:$D$109,B65),0)","v":0},{"$f":"IF(B65<>\"\",SUMIFS(cTABUI!$I$11:$I$109,cTABUI!$D$11:$D$109,B65),0)","v":0},{"$f":"IF(B65<>\"\",SUMIFS(cTABUI!$J$11:$J$109,cTABUI!$D$11:$D$109,B65),0)","v":0},{"$f":"IF(B65<>\"\",SUMIFS(cTABUI!$K$11:$K$109,cTABUI!$D$11:$D$109,B65),0)","v":0},{"$f":"IF(B65<>\"\",SUMIFS(cTABUI!$L$11:$L$109,cTABUI!$D$11:$D$109,B65),0)","v":0},{"$f":"IF(B65<>\"\",SUMIFS(cTABUI!$M$11:$M$109,cTABUI!$D$11:$D$109,B65),0)","v":0},{"$f":"IF(B65<>\"\",SUMIFS(cTABUI!$N$11:$N$109,cTABUI!$D$11:$D$109,B65),0)","v":0},{"$f":"IF(B65<>\"\",SUMIFS(cTABUI!$O$11:$O$109,cTABUI!$D$11:$D$109,B65),0)","v":0}]
[null,{"$f":"IF(iCONDOMINI!B66<>\"\",iCONDOMINI!B66,\"\")","v":"C56"},{"$f":"IF(iCONDOMINI!C66<>\"\",iCONDOMINI!C66,\"\")","v":""},{"$f":"IF(B66<>\"\",SUMIFS(cTABUI!$F$11:$F$109,cTABUI!$D$11:$D$109,B66),0)","v":0},{"$f":"IF(B66<>\"\",SUMIFS(cTABUI!$G$11:$G$109,cTABUI!$D$11:$D$109,B66),0)","v":0},{"$f":"IF(B66<>\"\",SUMIFS(cTABUI!$H$11:$H$109,cTABUI!$D$11:$D$109,B66),0)","v":0},{"$f":"IF(B66<>\"\",SUMIFS(cTABUI!$I$11:$I$109,cTABUI!$D$11:$D$109,B66),0)","v":0},{"$f":"IF(B66<>\"\",SUMIFS(cTABUI!$J$11:$J$109,cTABUI!$D$11:$D$109,B66),0)","v":0},{"$f":"IF(B66<>\"\",SUMIFS(cTABUI!$K$11:$K$109,cTABUI!$D$11:$D$109,B66),0)","v":0},{"$f":"IF(B66<>\"\",SUMIFS(cTABUI!$L$11:$L$109,cTABUI!$D$11:$D$109,B66),0)","v":0},{"$f":"IF(B66<>\"\",SUMIFS(cTABUI!$M$11:$M$109,cTABUI!$D$11:$D$109,B66),0)","v":0},{"$f":"IF(B66<>\"\",SUMIFS(cTABUI!$N$11:$N$109,cTABUI!$D$11:$D$109,B66),0)","v":0},{"$f":"IF(B66<>\"\",SUMIFS(cTABUI!$O$11:$O$109,cTABUI!$D$11:$D$109,B66),0)","v":0}]
[null,{"$f":"IF(iCONDOMINI!B67<>\"\",iCONDOMINI!B67,\"\")","v":"C57"},{"$f":"IF(iCONDOMINI!C67<>\"\",iCONDOMINI!C67,\"\")","v":""},{"$f":"IF(B67<>\"\",SUMIFS(cTABUI!$F$11:$F$109,cTABUI!$D$11:$D$109,B67),0)","v":0},{"$f":"IF(B67<>\"\",SUMIFS(cTABUI!$G$11:$G$109,cTABUI!$D$11:$D$109,B67),0)","v":0},{"$f":"IF(B67<>\"\",SUMIFS(cTABUI!$H$11:$H$109,cTABUI!$D$11:$D$109,B67),0)","v":0},{"$f":"IF(B67<>\"\",SUMIFS(cTABUI!$I$11:$I$109,cTABUI!$D$11:$D$109,B67),0)","v":0},{"$f":"IF(B67<>\"\",SUMIFS(cTABUI!$J$11:$J$109,cTABUI!$D$11:$D$109,B67),0)","v":0},{"$f":"IF(B67<>\"\",SUMIFS(cTABUI!$K$11:$K$109,cTABUI!$D$11:$D$109,B67),0)","v":0},{"$f":"IF(B67<>\"\",SUMIFS(cTABUI!$L$11:$L$109,cTABUI!$D$11:$D$109,B67),0)","v":0},{"$f":"IF(B67<>\"\",SUMIFS(cTABUI!$M$11:$M$109,cTABUI!$D$11:$D$109,B67),0)","v":0},{"$f":"IF(B67<>\"\",SUMIFS(cTABUI!$N$11:$N$109,cTABUI!$D$11:$D$109,B67),0)","v":0},{"$f":"IF(B67<>\"\",SUMIFS(cTABUI!$O$11:$O$109,cTABUI!$D$11:$D$109,B67),0)","v":0}]
[null,{"$f":"IF(iCONDOMINI!B68<>\"\",iCONDOMINI!B68,\"\")","v":"C58"},{"$f":"IF(iCONDOMINI!C68<>\"\",iCONDOMINI!C68,\"\")","v":""},{"$f":"IF(B68<>\"\",SUMIFS(cTABUI!$F$11:$F$109,cTABUI!$D$11:$D$109,B68),0)","v":0},{"$f":"IF(B68<>\"\",SUMIFS(cTABUI!$G$11:$G$109,cTABUI!$D$11:$D$109,B68),0)","v":0},{"$f":"IF(B68<>\"\",SUMIFS(cTABUI!$H$11:$H$109,cTABUI!$D$11:$D$109,B68),0)","v":0},{"$f":"IF(B68<>\"\",SUMIFS(cTABUI!$I$11:$I$109,cTABUI!$D$11:$D$109,B68),0)","v":0},{"$f":"IF(B68<>\"\",SUMIFS(cTABUI!$J$11:$J$109,cTABUI!$D$11:$D$109,B68),0)","v":0},{"$f":"IF(B68<>\"\",SUMIFS(cTABUI!$K$11:$K$109,cTABUI!$D$11:$D$109,B68),0)","v":0},{"$f":"IF(B68<>\"\",SUMIFS(cTABUI!$L$11:$L$109,cTABUI!$D$11:$D$109,B68),0)","v":0},{"$f":"IF(B68<>\"\",SUMIFS(cTABUI!$M$11:$M$109,cTABUI!$D$11:$D$109,B68),0)","v":0},{"$f":"IF(B68<>\"\",SUMIFS(cTABUI!$N$11:$N$109,cTABUI!$D$11:$D$109,B68),0)","v":0},{"$f":"IF(B68<>\"\",SUMIFS(cTABUI!$O$11:$O$109,cTABUI!$D$11:$D$109,B68),0)","v":0}]
[null,{"$f":"IF(iCONDOMINI!B69<>\"\",iCONDOMINI!B69,\"\")","v":"C59"},{"$f":"IF(iCONDOMINI!C69<>\"\",iCONDOMINI!C69,\"\")","v":""},{"$f":"IF(B69<>\"\",SUMIFS(cTABUI!$F$11:$F$109,cTABUI!$D$11:$D$109,B69),0)","v":0},{"$f":"IF(B69<>\"\",SUMIFS(cTABUI!$G$11:$G$109,cTABUI!$D$11:$D$109,B69),0)","v":0},{"$f":"IF(B69<>\"\",SUMIFS(cTABUI!$H$11:$H$109,cTABUI!$D$11:$D$109,B69),0)","v":0},{"$f":"IF(B69<>\"\",SUMIFS(cTABUI!$I$11:$I$109,cTABUI!$D$11:$D$109,B69),0)","v":0},{"$f":"IF(B69<>\"\",SUMIFS(cTABUI!$J$11:$J$109,cTABUI!$D$11:$D$109,B69),0)","v":0},{"$f":"IF(B69<>\"\",SUMIFS(cTABUI!$K$11:$K$109,cTABUI!$D$11:$D$109,B69),0)","v":0},{"$f":"IF(B69<>\"\",SUMIFS(cTABUI!$L$11:$L$109,cTABUI!$D$11:$D$109,B69),0)","v":0},{"$f":"IF(B69<>\"\",SUMIFS(cTABUI!$M$11:$M$109,cTABUI!$D$11:$D$109,B69),0)","v":0},{"$f":"IF(B69<>\"\",SUMIFS(cTABUI!$N$11:$N$109,cTABUI!$D$11:$D$109,B69),0)","v":0},{"$f":"IF(B69<>\"\",SUMIFS(cTABUI!$O$11:$O$109,cTABUI!$D$11:$D$109,B69),0)","v":0}]
[null,{"$f":"IF(iCONDOMINI!B70<>\"\",iCONDOMINI!B70,\"\")","v":"C60"},{"$f":"IF(iCONDOMINI!C70<>\"\",iCONDOMINI!C70,\"\")","v":""},{"$f":"IF(B70<>\"\",SUMIFS(cTABUI!$F$11:$F$109,cTABUI!$D$11:$D$109,B70),0)","v":0},{"$f":"IF(B70<>\"\",SUMIFS(cTABUI!$G$11:$G$109,cTABUI!$D$11:$D$109,B70),0)","v":0},{"$f":"IF(B70<>\"\",SUMIFS(cTABUI!$H$11:$H$109,cTABUI!$D$11:$D$109,B70),0)","v":0},{"$f":"IF(B70<>\"\",SUMIFS(cTABUI!$I$11:$I$109,cTABUI!$D$11:$D$109,B70),0)","v":0},{"$f":"IF(B70<>\"\",SUMIFS(cTABUI!$J$11:$J$109,cTABUI!$D$11:$D$109,B70),0)","v":0},{"$f":"IF(B70<>\"\",SUMIFS(cTABUI!$K$11:$K$109,cTABUI!$D$11:$D$109,B70),0)","v":0},{"$f":"IF(B70<>\"\",SUMIFS(cTABUI!$L$11:$L$109,cTABUI!$D$11:$D$109,B70),0)","v":0},{"$f":"IF(B70<>\"\",SUMIFS(cTABUI!$M$11:$M$109,cTABUI!$D$11:$D$109,B70),0)","v":0},{"$f":"IF(B70<>\"\",SUMIFS(cTABUI!$N$11:$N$109,cTABUI!$D$11:$D$109,B70),0)","v":0},{"$f":"IF(B70<>\"\",SUMIFS(cTABUI!$O$11:$O$109,cTABUI!$D$11:$D$109,B70),0)","v":0}]
[null,{"$f":"IF(iCONDOMINI!B71<>\"\",iCONDOMINI!B71,\"\")","v":"C61"},{"$f":"IF(iCONDOMINI!C71<>\"\",iCONDOMINI!C71,\"\")","v":""},{"$f":"IF(B71<>\"\",SUMIFS(cTABUI!$F$11:$F$109,cTABUI!$D$11:$D$109,B71),0)","v":0},{"$f":"IF(B71<>\"\",SUMIFS(cTABUI!$G$11:$G$109,cTABUI!$D$11:$D$109,B71),0)","v":0},{"$f":"IF(B71<>\"\",SUMIFS(cTABUI!$H$11:$H$109,cTABUI!$D$11:$D$109,B71),0)","v":0},{"$f":"IF(B71<>\"\",SUMIFS(cTABUI!$I$11:$I$109,cTABUI!$D$11:$D$109,B71),0)","v":0},{"$f":"IF(B71<>\"\",SUMIFS(cTABUI!$J$11:$J$109,cTABUI!$D$11:$D$109,B71),0)","v":0},{"$f":"IF(B71<>\"\",SUMIFS(cTABUI!$K$11:$K$109,cTABUI!$D$11:$D$109,B71),0)","v":0},{"$f":"IF(B71<>\"\",SUMIFS(cTABUI!$L$11:$L$109,cTABUI!$D$11:$D$109,B71),0)","v":0},{"$f":"IF(B71<>\"\",SUMIFS(cTABUI!$M$11:$M$109,cTABUI!$D$11:$D$109,B71),0)","v":0},{"$f":"IF(B71<>\"\",SUMIFS(cTABUI!$N$11:$N$109,cTABUI!$D$11:$D$109,B71),0)","v":0},{"$f":"IF(B71<>\"\",SUMIFS(cTABUI!$O$11:$O$109,cTABUI!$D$11:$D$109,B71),0)","v":0}]
[null,{"$f":"IF(iCONDOMINI!B72<>\"\",iCONDOMINI!B72,\"\")","v":"C62"},{"$f":"IF(iCONDOMINI!C72<>\"\",iCONDOMINI!C72,\"\")","v":""},{"$f":"IF(B72<>\"\",SUMIFS(cTABUI!$F$11:$F$109,cTABUI!$D$11:$D$109,B72),0)","v":0},{"$f":"IF(B72<>\"\",SUMIFS(cTABUI!$G$11:$G$109,cTABUI!$D$11:$D$109,B72),0)","v":0},{"$f":"IF(B72<>\"\",SUMIFS(cTABUI!$H$11:$H$109,cTABUI!$D$11:$D$109,B72),0)","v":0},{"$f":"IF(B72<>\"\",SUMIFS(cTABUI!$I$11:$I$109,cTABUI!$D$11:$D$109,B72),0)","v":0},{"$f":"IF(B72<>\"\",SUMIFS(cTABUI!$J$11:$J$109,cTABUI!$D$11:$D$109,B72),0)","v":0},{"$f":"IF(B72<>\"\",SUMIFS(cTABUI!$K$11:$K$109,cTABUI!$D$11:$D$109,B72),0)","v":0},{"$f":"IF(B72<>\"\",SUMIFS(cTABUI!$L$11:$L$109,cTABUI!$D$11:$D$109,B72),0)","v":0},{"$f":"IF(B72<>\"\",SUMIFS(cTABUI!$M$11:$M$109,cTABUI!$D$11:$D$109,B72),0)","v":0},{"$f":"IF(B72<>\"\",SUMIFS(cTABUI!$N$11:$N$109,cTABUI!$D$11:$D$109,B72),0)","v":0},{"$f":"IF(B72<>\"\",SUMIFS(cTABUI!$O$11:$O$109,cTABUI!$D$11:$D$109,B72),0)","v":0}]
[null,{"$f":"IF(iCONDOMINI!B73<>\"\",iCONDOMINI!B73,\"\")","v":"C63"},{"$f":"IF(iCONDOMINI!C73<>\"\",iCONDOMINI!C73,\"\")","v":""},{"$f":"IF(B73<>\"\",SUMIFS(cTABUI!$F$11:$F$109,cTABUI!$D$11:$D$109,B73),0)","v":0},{"$f":"IF(B73<>\"\",SUMIFS(cTABUI!$G$11:$G$109,cTABUI!$D$11:$D$109,B73),0)","v":0},{"$f":"IF(B73<>\"\",SUMIFS(cTABUI!$H$11:$H$109,cTABUI!$D$11:$D$109,B73),0)","v":0},{"$f":"IF(B73<>\"\",SUMIFS(cTABUI!$I$11:$I$109,cTABUI!$D$11:$D$109,B73),0)","v":0},{"$f":"IF(B73<>\"\",SUMIFS(cTABUI!$J$11:$J$109,cTABUI!$D$11:$D$109,B73),0)","v":0},{"$f":"IF(B73<>\"\",SUMIFS(cTABUI!$K$11:$K$109,cTABUI!$D$11:$D$109,B73),0)","v":0},{"$f":"IF(B73<>\"\",SUMIFS(cTABUI!$L$11:$L$109,cTABUI!$D$11:$D$109,B73),0)","v":0},{"$f":"IF(B73<>\"\",SUMIFS(cTABUI!$M$11:$M$109,cTABUI!$D$11:$D$109,B73),0)","v":0},{"$f":"IF(B73<>\"\",SUMIFS(cTABUI!$N$11:$N$109,cTABUI!$D$11:$D$109,B73),0)","v":0},{"$f":"IF(B73<>\"\",SUMIFS(cTABUI!$O$11:$O$109,cTABUI!$D$11:$D$109,B73),0)","v":0}]
[null,{"$f":"IF(iCONDOMINI!B74<>\"\",iCONDOMINI!B74,\"\")","v":"C64"},{"$f":"IF(iCONDOMINI!C74<>\"\",iCONDOMINI!C74,\"\")","v":""},{"$f":"IF(B74<>\"\",SUMIFS(cTABUI!$F$11:$F$109,cTABUI!$D$11:$D$109,B74),0)","v":0},{"$f":"IF(B74<>\"\",SUMIFS(cTABUI!$G$11:$G$109,cTABUI!$D$11:$D$109,B74),0)","v":0},{"$f":"IF(B74<>\"\",SUMIFS(cTABUI!$H$11:$H$109,cTABUI!$D$11:$D$109,B74),0)","v":0},{"$f":"IF(B74<>\"\",SUMIFS(cTABUI!$I$11:$I$109,cTABUI!$D$11:$D$109,B74),0)","v":0},{"$f":"IF(B74<>\"\",SUMIFS(cTABUI!$J$11:$J$109,cTABUI!$D$11:$D$109,B74),0)","v":0},{"$f":"IF(B74<>\"\",SUMIFS(cTABUI!$K$11:$K$109,cTABUI!$D$11:$D$109,B74),0)","v":0},{"$f":"IF(B74<>\"\",SUMIFS(cTABUI!$L$11:$L$109,cTABUI!$D$11:$D$109,B74),0)","v":0},{"$f":"IF(B74<>\"\",SUMIFS(cTABUI!$M$11:$M$109,cTABUI!$D$11:$D$109,B74),0)","v":0},{"$f":"IF(B74<>\"\",SUMIFS(cTABUI!$N$11:$N$109,cTABUI!$D$11:$D$109,B74),0)","v":0},{"$f":"IF(B74<>\"\",SUMIFS(cTABUI!$O$11:$O$109,cTABUI!$D$11:$D$109,B74),0)","v":0}]
[null,{"$f":"IF(iCONDOMINI!B75<>\"\",iCONDOMINI!B75,\"\")","v":"C65"},{"$f":"IF(iCONDOMINI!C75<>\"\",iCONDOMINI!C75,\"\")","v":""},{"$f":"IF(B75<>\"\",SUMIFS(cTABUI!$F$11:$F$109,cTABUI!$D$11:$D$109,B75),0)","v":0},{"$f":"IF(B75<>\"\",SUMIFS(cTABUI!$G$11:$G$109,cTABUI!$D$11:$D$109,B75),0)","v":0},{"$f":"IF(B75<>\"\",SUMIFS(cTABUI!$H$11:$H$109,cTABUI!$D$11:$D$109,B75),0)","v":0},{"$f":"IF(B75<>\"\",SUMIFS(cTABUI!$I$11:$I$109,cTABUI!$D$11:$D$109,B75),0)","v":0},{"$f":"IF(B75<>\"\",SUMIFS(cTABUI!$J$11:$J$109,cTABUI!$D$11:$D$109,B75),0)","v":0},{"$f":"IF(B75<>\"\",SUMIFS(cTABUI!$K$11:$K$109,cTABUI!$D$11:$D$109,B75),0)","v":0},{"$f":"IF(B75<>\"\",SUMIFS(cTABUI!$L$11:$L$109,cTABUI!$D$11:$D$109,B75),0)","v":0},{"$f":"IF(B75<>\"\",SUMIFS(cTABUI!$M$11:$M$109,cTABUI!$D$11:$D$109,B75),0)","v":0},{"$f":"IF(B75<>\"\",SUMIFS(cTABUI!$N$11:$N$109,cTABUI!$D$11:$D$109,B75),0)","v":0},{"$f":"IF(B75<>\"\",SUMIFS(cTABUI!$O$11:$O$109,cTABUI!$D$11:$D$109,B75),0)","v":0}]
[null,{"$f":"IF(iCONDOMINI!B76<>\"\",iCONDOMINI!B76,\"\")","v":"C66"},{"$f":"IF(iCONDOMINI!C76<>\"\",iCONDOMINI!C76,\"\")","v":""},{"$f":"IF(B76<>\"\",SUMIFS(cTABUI!$F$11:$F$109,cTABUI!$D$11:$D$109,B76),0)","v":0},{"$f":"IF(B76<>\"\",SUMIFS(cTABUI!$G$11:$G$109,cTABUI!$D$11:$D$109,B76),0)","v":0},{"$f":"IF(B76<>\"\",SUMIFS(cTABUI!$H$11:$H$109,cTABUI!$D$11:$D$109,B76),0)","v":0},{"$f":"IF(B76<>\"\",SUMIFS(cTABUI!$I$11:$I$109,cTABUI!$D$11:$D$109,B76),0)","v":0},{"$f":"IF(B76<>\"\",SUMIFS(cTABUI!$J$11:$J$109,cTABUI!$D$11:$D$109,B76),0)","v":0},{"$f":"IF(B76<>\"\",SUMIFS(cTABUI!$K$11:$K$109,cTABUI!$D$11:$D$109,B76),0)","v":0},{"$f":"IF(B76<>\"\",SUMIFS(cTABUI!$L$11:$L$109,cTABUI!$D$11:$D$109,B76),0)","v":0},{"$f":"IF(B76<>\"\",SUMIFS(cTABUI!$M$11:$M$109,cTABUI!$D$11:$D$109,B76),0)","v":0},{"$f":"IF(B76<>\"\",SUMIFS(cTABUI!$N$11:$N$109,cTABUI!$D$11:$D$109,B76),0)","v":0},{"$f":"IF(B76<>\"\",SUMIFS(cTABUI!$O$11:$O$109,cTABUI!$D$11:$D$109,B76),0)","v":0}]
[null,{"$f":"IF(iCONDOMINI!B77<>\"\",iCONDOMINI!B77,\"\")","v":"C67"},{"$f":"IF(iCONDOMINI!C77<>\"\",iCONDOMINI!C77,\"\")","v":""},{"$f":"IF(B77<>\"\",SUMIFS(cTABUI!$F$11:$F$109,cTABUI!$D$11:$D$109,B77),0)","v":0},{"$f":"IF(B77<>\"\",SUMIFS(cTABUI!$G$11:$G$109,cTABUI!$D$11:$D$109,B77),0)","v":0},{"$f":"IF(B77<>\"\",SUMIFS(cTABUI!$H$11:$H$109,cTABUI!$D$11:$D$109,B77),0)","v":0},{"$f":"IF(B77<>\"\",SUMIFS(cTABUI!$I$11:$I$109,cTABUI!$D$11:$D$109,B77),0)","v":0},{"$f":"IF(B77<>\"\",SUMIFS(cTABUI!$J$11:$J$109,cTABUI!$D$11:$D$109,B77),0)","v":0},{"$f":"IF(B77<>\"\",SUMIFS(cTABUI!$K$11:$K$109,cTABUI!$D$11:$D$109,B77),0)","v":0},{"$f":"IF(B77<>\"\",SUMIFS(cTABUI!$L$11:$L$109,cTABUI!$D$11:$D$109,B77),0)","v":0},{"$f":"IF(B77<>\"\",SUMIFS(cTABUI!$M$11:$M$109,cTABUI!$D$11:$D$109,B77),0)","v":0},{"$f":"IF(B77<>\"\",SUMIFS(cTABUI!$N$11:$N$109,cTABUI!$D$11:$D$109,B77),0)","v":0},{"$f":"IF(B77<>\"\",SUMIFS(cTABUI!$O$11:$O$109,cTABUI!$D$11:$D$109,B77),0)","v":0}]
[null,{"$f":"IF(iCONDOMINI!B78<>\"\",iCONDOMINI!B78,\"\")","v":"C68"},{"$f":"IF(iCONDOMINI!C78<>\"\",iCONDOMINI!C78,\"\")","v":""},{"$f":"IF(B78<>\"\",SUMIFS(cTABUI!$F$11:$F$109,cTABUI!$D$11:$D$109,B78),0)","v":0},{"$f":"IF(B78<>\"\",SUMIFS(cTABUI!$G$11:$G$109,cTABUI!$D$11:$D$109,B78),0)","v":0},{"$f":"IF(B78<>\"\",SUMIFS(cTABUI!$H$11:$H$109,cTABUI!$D$11:$D$109,B78),0)","v":0},{"$f":"IF(B78<>\"\",SUMIFS(cTABUI!$I$11:$I$109,cTABUI!$D$11:$D$109,B78),0)","v":0},{"$f":"IF(B78<>\"\",SUMIFS(cTABUI!$J$11:$J$109,cTABUI!$D$11:$D$109,B78),0)","v":0},{"$f":"IF(B78<>\"\",SUMIFS(cTABUI!$K$11:$K$109,cTABUI!$D$11:$D$109,B78),0)","v":0},{"$f":"IF(B78<>\"\",SUMIFS(cTABUI!$L$11:$L$109,cTABUI!$D$11:$D$109,B78),0)","v":0},{"$f":"IF(B78<>\"\",SUMIFS(cTABUI!$M$11:$M$109,cTABUI!$D$11:$D$109,B78),0)","v":0},{"$f":"IF(B78<>\"\",SUMIFS(cTABUI!$N$11:$N$109,cTABUI!$D$11:$D$109,B78),0)","v":0},{"$f":"IF(B78<>\"\",SUMIFS(cTABUI!$O$11:$O$109,cTABUI!$D$11:$D$109,B78),0)","v":0}]
[null,{"$f":"IF(iCONDOMINI!B79<>\"\",iCONDOMINI!B79,\"\")","v":"C69"},{"$f":"IF(iCONDOMINI!C79<>\"\",iCONDOMINI!C79,\"\")","v":""},{"$f":"IF(B79<>\"\",SUMIFS(cTABUI!$F$11:$F$109,cTABUI!$D$11:$D$109,B79),0)","v":0},{"$f":"IF(B79<>\"\",SUMIFS(cTABUI!$G$11:$G$109,cTABUI!$D$11:$D$109,B79),0)","v":0},{"$f":"IF(B79<>\"\",SUMIFS(cTABUI!$H$11:$H$109,cTABUI!$D$11:$D$109,B79),0)","v":0},{"$f":"IF(B79<>\"\",SUMIFS(cTABUI!$I$11:$I$109,cTABUI!$D$11:$D$109,B79),0)","v":0},{"$f":"IF(B79<>\"\",SUMIFS(cTABUI!$J$11:$J$109,cTABUI!$D$11:$D$109,B79),0)","v":0},{"$f":"IF(B79<>\"\",SUMIFS(cTABUI!$K$11:$K$109,cTABUI!$D$11:$D$109,B79),0)","v":0},{"$f":"IF(B79<>\"\",SUMIFS(cTABUI!$L$11:$L$109,cTABUI!$D$11:$D$109,B79),0)","v":0},{"$f":"IF(B79<>\"\",SUMIFS(cTABUI!$M$11:$M$109,cTABUI!$D$11:$D$109,B79),0)","v":0},{"$f":"IF(B79<>\"\",SUMIFS(cTABUI!$N$11:$N$109,cTABUI!$D$11:$D$109,B79),0)","v":0},{"$f":"IF(B79<>\"\",SUMIFS(cTABUI!$O$11:$O$109,cTABUI!$D$11:$D$109,B79),0)","v":0}]
[null,{"$f":"IF(iCONDOMINI!B80<>\"\",iCONDOMINI!B80,\"\")","v":"C70"},{"$f":"IF(iCONDOMINI!C80<>\"\",iCONDOMINI!C80,\"\")","v":""},{"$f":"IF(B80<>\"\",SUMIFS(cTABUI!$F$11:$F$109,cTABUI!$D$11:$D$109,B80),0)","v":0},{"$f":"IF(B80<>\"\",SUMIFS(cTABUI!$G$11:$G$109,cTABUI!$D$11:$D$109,B80),0)","v":0},{"$f":"IF(B80<>\"\",SUMIFS(cTABUI!$H$11:$H$109,cTABUI!$D$11:$D$109,B80),0)","v":0},{"$f":"IF(B80<>\"\",SUMIFS(cTABUI!$I$11:$I$109,cTABUI!$D$11:$D$109,B80),0)","v":0},{"$f":"IF(B80<>\"\",SUMIFS(cTABUI!$J$11:$J$109,cTABUI!$D$11:$D$109,B80),0)","v":0},{"$f":"IF(B80<>\"\",SUMIFS(cTABUI!$K$11:$K$109,cTABUI!$D$11:$D$109,B80),0)","v":0},{"$f":"IF(B80<>\"\",SUMIFS(cTABUI!$L$11:$L$109,cTABUI!$D$11:$D$109,B80),0)","v":0},{"$f":"IF(B80<>\"\",SUMIFS(cTABUI!$M$11:$M$109,cTABUI!$D$11:$D$109,B80),0)","v":0},{"$f":"IF(B80<>\"\",SUMIFS(cTABUI!$N$11:$N$109,cTABUI!$D$11:$D$109,B80),0)","v":0},{"$f":"IF(B80<>\"\",SUMIFS(cTABUI!$O$11:$O$109,cTABUI!$D$11:$D$109,B80),0)","v":0}]
[null,{"$f":"IF(iCONDOMINI!B81<>\"\",iCONDOMINI!B81,\"\")","v":"C71"},{"$f":"IF(iCONDOMINI!C81<>\"\",iCONDOMINI!C81,\"\")","v":""},{"$f":"IF(B81<>\"\",SUMIFS(cTABUI!$F$11:$F$109,cTABUI!$D$11:$D$109,B81),0)","v":0},{"$f":"IF(B81<>\"\",SUMIFS(cTABUI!$G$11:$G$109,cTABUI!$D$11:$D$109,B81),0)","v":0},{"$f":"IF(B81<>\"\",SUMIFS(cTABUI!$H$11:$H$109,cTABUI!$D$11:$D$109,B81),0)","v":0},{"$f":"IF(B81<>\"\",SUMIFS(cTABUI!$I$11:$I$109,cTABUI!$D$11:$D$109,B81),0)","v":0},{"$f":"IF(B81<>\"\",SUMIFS(cTABUI!$J$11:$J$109,cTABUI!$D$11:$D$109,B81),0)","v":0},{"$f":"IF(B81<>\"\",SUMIFS(cTABUI!$K$11:$K$109,cTABUI!$D$11:$D$109,B81),0)","v":0},{"$f":"IF(B81<>\"\",SUMIFS(cTABUI!$L$11:$L$109,cTABUI!$D$11:$D$109,B81),0)","v":0},{"$f":"IF(B81<>\"\",SUMIFS(cTABUI!$M$11:$M$109,cTABUI!$D$11:$D$109,B81),0)","v":0},{"$f":"IF(B81<>\"\",SUMIFS(cTABUI!$N$11:$N$109,cTABUI!$D$11:$D$109,B81),0)","v":0},{"$f":"IF(B81<>\"\",SUMIFS(cTABUI!$O$11:$O$109,cTABUI!$D$11:$D$109,B81),0)","v":0}]
[null,{"$f":"IF(iCONDOMINI!B82<>\"\",iCONDOMINI!B82,\"\")","v":"C72"},{"$f":"IF(iCONDOMINI!C82<>\"\",iCONDOMINI!C82,\"\")","v":""},{"$f":"IF(B82<>\"\",SUMIFS(cTABUI!$F$11:$F$109,cTABUI!$D$11:$D$109,B82),0)","v":0},{"$f":"IF(B82<>\"\",SUMIFS(cTABUI!$G$11:$G$109,cTABUI!$D$11:$D$109,B82),0)","v":0},{"$f":"IF(B82<>\"\",SUMIFS(cTABUI!$H$11:$H$109,cTABUI!$D$11:$D$109,B82),0)","v":0},{"$f":"IF(B82<>\"\",SUMIFS(cTABUI!$I$11:$I$109,cTABUI!$D$11:$D$109,B82),0)","v":0},{"$f":"IF(B82<>\"\",SUMIFS(cTABUI!$J$11:$J$109,cTABUI!$D$11:$D$109,B82),0)","v":0},{"$f":"IF(B82<>\"\",SUMIFS(cTABUI!$K$11:$K$109,cTABUI!$D$11:$D$109,B82),0)","v":0},{"$f":"IF(B82<>\"\",SUMIFS(cTABUI!$L$11:$L$109,cTABUI!$D$11:$D$109,B82),0)","v":0},{"$f":"IF(B82<>\"\",SUMIFS(cTABUI!$M$11:$M$109,cTABUI!$D$11:$D$109,B82),0)","v":0},{"$f":"IF(B82<>\"\",SUMIFS(cTABUI!$N$11:$N$109,cTABUI!$D$11:$D$109,B82),0)","v":0},{"$f":"IF(B82<>\"\",SUMIFS(cTABUI!$O$11:$O$109,cTABUI!$D$11:$D$109,B82),0)","v":0}]
[null,{"$f":"IF(iCONDOMINI!B83<>\"\",iCONDOMINI!B83,\"\")","v":"C73"},{"$f":"IF(iCONDOMINI!C83<>\"\",iCONDOMINI!C83,\"\")","v":""},{"$f":"IF(B83<>\"\",SUMIFS(cTABUI!$F$11:$F$109,cTABUI!$D$11:$D$109,B83),0)","v":0},{"$f":"IF(B83<>\"\",SUMIFS(cTABUI!$G$11:$G$109,cTABUI!$D$11:$D$109,B83),0)","v":0},{"$f":"IF(B83<>\"\",SUMIFS(cTABUI!$H$11:$H$109,cTABUI!$D$11:$D$109,B83),0)","v":0},{"$f":"IF(B83<>\"\",SUMIFS(cTABUI!$I$11:$I$109,cTABUI!$D$11:$D$109,B83),0)","v":0},{"$f":"IF(B83<>\"\",SUMIFS(cTABUI!$J$11:$J$109,cTABUI!$D$11:$D$109,B83),0)","v":0},{"$f":"IF(B83<>\"\",SUMIFS(cTABUI!$K$11:$K$109,cTABUI!$D$11:$D$109,B83),0)","v":0},{"$f":"IF(B83<>\"\",SUMIFS(cTABUI!$L$11:$L$109,cTABUI!$D$11:$D$109,B83),0)","v":0},{"$f":"IF(B83<>\"\",SUMIFS(cTABUI!$M$11:$M$109,cTABUI!$D$11:$D$109,B83),0)","v":0},{"$f":"IF(B83<>\"\",SUMIFS(cTABUI!$N$11:$N$109,cTABUI!$D$11:$D$109,B83),0)","v":0},{"$f":"IF(B83<>\"\",SUMIFS(cTABUI!$O$11:$O$109,cTABUI!$D$11:$D$109,B83),0)","v":0}]
[null,{"$f":"IF(iCONDOMINI!B84<>\"\",iCONDOMINI!B84,\"\")","v":"C74"},{"$f":"IF(iCONDOMINI!C84<>\"\",iCONDOMINI!C84,\"\")","v":""},{"$f":"IF(B84<>\"\",SUMIFS(cTABUI!$F$11:$F$109,cTABUI!$D$11:$D$109,B84),0)","v":0},{"$f":"IF(B84<>\"\",SUMIFS(cTABUI!$G$11:$G$109,cTABUI!$D$11:$D$109,B84),0)","v":0},{"$f":"IF(B84<>\"\",SUMIFS(cTABUI!$H$11:$H$109,cTABUI!$D$11:$D$109,B84),0)","v":0},{"$f":"IF(B84<>\"\",SUMIFS(cTABUI!$I$11:$I$109,cTABUI!$D$11:$D$109,B84),0)","v":0},{"$f":"IF(B84<>\"\",SUMIFS(cTABUI!$J$11:$J$109,cTABUI!$D$11:$D$109,B84),0)","v":0},{"$f":"IF(B84<>\"\",SUMIFS(cTABUI!$K$11:$K$109,cTABUI!$D$11:$D$109,B84),0)","v":0},{"$f":"IF(B84<>\"\",SUMIFS(cTABUI!$L$11:$L$109,cTABUI!$D$11:$D$109,B84),0)","v":0},{"$f":"IF(B84<>\"\",SUMIFS(cTABUI!$M$11:$M$109,cTABUI!$D$11:$D$109,B84),0)","v":0},{"$f":"IF(B84<>\"\",SUMIFS(cTABUI!$N$11:$N$109,cTABUI!$D$11:$D$109,B84),0)","v":0},{"$f":"IF(B84<>\"\",SUMIFS(cTABUI!$O$11:$O$109,cTABUI!$D$11:$D$109,B84),0)","v":0}]
[null,{"$f":"IF(iCONDOMINI!B85<>\"\",iCONDOMINI!B85,\"\")","v":"C75"},{"$f":"IF(iCONDOMINI!C85<>\"\",iCONDOMINI!C85,\"\")","v":""},{"$f":"IF(B85<>\"\",SUMIFS(cTABUI!$F$11:$F$109,cTABUI!$D$11:$D$109,B85),0)","v":0},{"$f":"IF(B85<>\"\",SUMIFS(cTABUI!$G$11:$G$109,cTABUI!$D$11:$D$109,B85),0)","v":0},{"$f":"IF(B85<>\"\",SUMIFS(cTABUI!$H$11:$H$109,cTABUI!$D$11:$D$109,B85),0)","v":0},{"$f":"IF(B85<>\"\",SUMIFS(cTABUI!$I$11:$I$109,cTABUI!$D$11:$D$109,B85),0)","v":0},{"$f":"IF(B85<>\"\",SUMIFS(cTABUI!$J$11:$J$109,cTABUI!$D$11:$D$109,B85),0)","v":0},{"$f":"IF(B85<>\"\",SUMIFS(cTABUI!$K$11:$K$109,cTABUI!$D$11:$D$109,B85),0)","v":0},{"$f":"IF(B85<>\"\",SUMIFS(cTABUI!$L$11:$L$109,cTABUI!$D$11:$D$109,B85),0)","v":0},{"$f":"IF(B85<>\"\",SUMIFS(cTABUI!$M$11:$M$109,cTABUI!$D$11:$D$109,B85),0)","v":0},{"$f":"IF(B85<>\"\",SUMIFS(cTABUI!$N$11:$N$109,cTABUI!$D$11:$D$109,B85),0)","v":0},{"$f":"IF(B85<>\"\",SUMIFS(cTABUI!$O$11:$O$109,cTABUI!$D$11:$D$109,B85),0)","v":0}]
[null,{"$f":"IF(iCONDOMINI!B86<>\"\",iCONDOMINI!B86,\"\")","v":"C76"},{"$f":"IF(iCONDOMINI!C86<>\"\",iCONDOMINI!C86,\"\")","v":""},{"$f":"IF(B86<>\"\",SUMIFS(cTABUI!$F$11:$F$109,cTABUI!$D$11:$D$109,B86),0)","v":0},{"$f":"IF(B86<>\"\",SUMIFS(cTABUI!$G$11:$G$109,cTABUI!$D$11:$D$109,B86),0)","v":0},{"$f":"IF(B86<>\"\",SUMIFS(cTABUI!$H$11:$H$109,cTABUI!$D$11:$D$109,B86),0)","v":0},{"$f":"IF(B86<>\"\",SUMIFS(cTABUI!$I$11:$I$109,cTABUI!$D$11:$D$109,B86),0)","v":0},{"$f":"IF(B86<>\"\",SUMIFS(cTABUI!$J$11:$J$109,cTABUI!$D$11:$D$109,B86),0)","v":0},{"$f":"IF(B86<>\"\",SUMIFS(cTABUI!$K$11:$K$109,cTABUI!$D$11:$D$109,B86),0)","v":0},{"$f":"IF(B86<>\"\",SUMIFS(cTABUI!$L$11:$L$109,cTABUI!$D$11:$D$109,B86),0)","v":0},{"$f":"IF(B86<>\"\",SUMIFS(cTABUI!$M$11:$M$109,cTABUI!$D$11:$D$109,B86),0)","v":0},{"$f":"IF(B86<>\"\",SUMIFS(cTABUI!$N$11:$N$109,cTABUI!$D$11:$D$109,B86),0)","v":0},{"$f":"IF(B86<>\"\",SUMIFS(cTABUI!$O$11:$O$109,cTABUI!$D$11:$D$109,B86),0)","v":0}]
[null,{"$f":"IF(iCONDOMINI!B87<>\"\",iCONDOMINI!B87,\"\")","v":"C77"},{"$f":"IF(iCONDOMINI!C87<>\"\",iCONDOMINI!C87,\"\")","v":""},{"$f":"IF(B87<>\"\",SUMIFS(cTABUI!$F$11:$F$109,cTABUI!$D$11:$D$109,B87),0)","v":0},{"$f":"IF(B87<>\"\",SUMIFS(cTABUI!$G$11:$G$109,cTABUI!$D$11:$D$109,B87),0)","v":0},{"$f":"IF(B87<>\"\",SUMIFS(cTABUI!$H$11:$H$109,cTABUI!$D$11:$D$109,B87),0)","v":0},{"$f":"IF(B87<>\"\",SUMIFS(cTABUI!$I$11:$I$109,cTABUI!$D$11:$D$109,B87),0)","v":0},{"$f":"IF(B87<>\"\",SUMIFS(cTABUI!$J$11:$J$109,cTABUI!$D$11:$D$109,B87),0)","v":0},{"$f":"IF(B87<>\"\",SUMIFS(cTABUI!$K$11:$K$109,cTABUI!$D$11:$D$109,B87),0)","v":0},{"$f":"IF(B87<>\"\",SUMIFS(cTABUI!$L$11:$L$109,cTABUI!$D$11:$D$109,B87),0)","v":0},{"$f":"IF(B87<>\"\",SUMIFS(cTABUI!$M$11:$M$109,cTABUI!$D$11:$D$109,B87),0)","v":0},{"$f":"IF(B87<>\"\",SUMIFS(cTABUI!$N$11:$N$109,cTABUI!$D$11:$D$109,B87),0)","v":0},{"$f":"IF(B87<>\"\",SUMIFS(cTABUI!$O$11:$O$109,cTABUI!$D$11:$D$109,B87),0)","v":0}]
[null,{"$f":"IF(iCONDOMINI!B88<>\"\",iCONDOMINI!B88,\"\")","v":"C78"},{"$f":"IF(iCONDOMINI!C88<>\"\",iCONDOMINI!C88,\"\")","v":""},{"$f":"IF(B88<>\"\",SUMIFS(cTABUI!$F$11:$F$109,cTABUI!$D$11:$D$109,B88),0)","v":0},{"$f":"IF(B88<>\"\",SUMIFS(cTABUI!$G$11:$G$109,cTABUI!$D$11:$D$109,B88),0)","v":0},{"$f":"IF(B88<>\"\",SUMIFS(cTABUI!$H$11:$H$109,cTABUI!$D$11:$D$109,B88),0)","v":0},{"$f":"IF(B88<>\"\",SUMIFS(cTABUI!$I$11:$I$109,cTABUI!$D$11:$D$109,B88),0)","v":0},{"$f":"IF(B88<>\"\",SUMIFS(cTABUI!$J$11:$J$109,cTABUI!$D$11:$D$109,B88),0)","v":0},{"$f":"IF(B88<>\"\",SUMIFS(cTABUI!$K$11:$K$109,cTABUI!$D$11:$D$109,B88),0)","v":0},{"$f":"IF(B88<>\"\",SUMIFS(cTABUI!$L$11:$L$109,cTABUI!$D$11:$D$109,B88),0)","v":0},{"$f":"IF(B88<>\"\",SUMIFS(cTABUI!$M$11:$M$109,cTABUI!$D$11:$D$109,B88),0)","v":0},{"$f":"IF(B88<>\"\",SUMIFS(cTABUI!$N$11:$N$109,cTABUI!$D$11:$D$109,B88),0)","v":0},{"$f":"IF(B88<>\"\",SUMIFS(cTABUI!$O$11:$O$109,cTABUI!$D$11:$D$109,B88),0)","v":0}]
[null,{"$f":"IF(iCONDOMINI!B89<>\"\",iCONDOMINI!B89,\"\")","v":"C79"},{"$f":"IF(iCONDOMINI!C89<>\"\",iCONDOMINI!C89,\"\")","v":""},{"$f":"IF(B89<>\"\",SUMIFS(cTABUI!$F$11:$F$109,cTABUI!$D$11:$D$109,B89),0)","v":0},{"$f":"IF(B89<>\"\",SUMIFS(cTABUI!$G$11:$G$109,cTABUI!$D$11:$D$109,B89),0)","v":0},{"$f":"IF(B89<>\"\",SUMIFS(cTABUI!$H$11:$H$109,cTABUI!$D$11:$D$109,B89),0)","v":0},{"$f":"IF(B89<>\"\",SUMIFS(cTABUI!$I$11:$I$109,cTABUI!$D$11:$D$109,B89),0)","v":0},{"$f":"IF(B89<>\"\",SUMIFS(cTABUI!$J$11:$J$109,cTABUI!$D$11:$D$109,B89),0)","v":0},{"$f":"IF(B89<>\"\",SUMIFS(cTABUI!$K$11:$K$109,cTABUI!$D$11:$D$109,B89),0)","v":0},{"$f":"IF(B89<>\"\",SUMIFS(cTABUI!$L$11:$L$109,cTABUI!$D$11:$D$109,B89),0)","v":0},{"$f":"IF(B89<>\"\",SUMIFS(cTABUI!$M$11:$M$109,cTABUI!$D$11:$D$109,B89),0)","v":0},{"$f":"IF(B89<>\"\",SUMIFS(cTABUI!$N$11:$N$109,cTABUI!$D$11:$D$109,B89),0)","v":0},{"$f":"IF(B89<>\"\",SUMIFS(cTABUI!$O$11:$O$109,cTABUI!$D$11:$D$109,B89),0)","v":0}]
[null,{"$f":"IF(iCONDOMINI!B90<>\"\",iCONDOMINI!B90,\"\")","v":"C80"},{"$f":"IF(iCONDOMINI!C90<>\"\",iCONDOMINI!C90,\"\")","v":""},{"$f":"IF(B90<>\"\",SUMIFS(cTABUI!$F$11:$F$109,cTABUI!$D$11:$D$109,B90),0)","v":0},{"$f":"IF(B90<>\"\",SUMIFS(cTABUI!$G$11:$G$109,cTABUI!$D$11:$D$109,B90),0)","v":0},{"$f":"IF(B90<>\"\",SUMIFS(cTABUI!$H$11:$H$109,cTABUI!$D$11:$D$109,B90),0)","v":0},{"$f":"IF(B90<>\"\",SUMIFS(cTABUI!$I$11:$I$109,cTABUI!$D$11:$D$109,B90),0)","v":0},{"$f":"IF(B90<>\"\",SUMIFS(cTABUI!$J$11:$J$109,cTABUI!$D$11:$D$109,B90),0)","v":0},{"$f":"IF(B90<>\"\",SUMIFS(cTABUI!$K$11:$K$109,cTABUI!$D$11:$D$109,B90),0)","v":0},{"$f":"IF(B90<>\"\",SUMIFS(cTABUI!$L$11:$L$109,cTABUI!$D$11:$D$109,B90),0)","v":0},{"$f":"IF(B90<>\"\",SUMIFS(cTABUI!$M$11:$M$109,cTABUI!$D$11:$D$109,B90),0)","v":0},{"$f":"IF(B90<>\"\",SUMIFS(cTABUI!$N$11:$N$109,cTABUI!$D$11:$D$109,B90),0)","v":0},{"$f":"IF(B90<>\"\",SUMIFS(cTABUI!$O$11:$O$109,cTABUI!$D$11:$D$109,B90),0)","v":0}]
[null,{"$f":"IF(iCONDOMINI!B91<>\"\",iCONDOMINI!B91,\"\")","v":"C81"},{"$f":"IF(iCONDOMINI!C91<>\"\",iCONDOMINI!C91,\"\")","v":""},{"$f":"IF(B91<>\"\",SUMIFS(cTABUI!$F$11:$F$109,cTABUI!$D$11:$D$109,B91),0)","v":0},{"$f":"IF(B91<>\"\",SUMIFS(cTABUI!$G$11:$G$109,cTABUI!$D$11:$D$109,B91),0)","v":0},{"$f":"IF(B91<>\"\",SUMIFS(cTABUI!$H$11:$H$109,cTABUI!$D$11:$D$109,B91),0)","v":0},{"$f":"IF(B91<>\"\",SUMIFS(cTABUI!$I$11:$I$109,cTABUI!$D$11:$D$109,B91),0)","v":0},{"$f":"IF(B91<>\"\",SUMIFS(cTABUI!$J$11:$J$109,cTABUI!$D$11:$D$109,B91),0)","v":0},{"$f":"IF(B91<>\"\",SUMIFS(cTABUI!$K$11:$K$109,cTABUI!$D$11:$D$109,B91),0)","v":0},{"$f":"IF(B91<>\"\",SUMIFS(cTABUI!$L$11:$L$109,cTABUI!$D$11:$D$109,B91),0)","v":0},{"$f":"IF(B91<>\"\",SUMIFS(cTABUI!$M$11:$M$109,cTABUI!$D$11:$D$109,B91),0)","v":0},{"$f":"IF(B91<>\"\",SUMIFS(cTABUI!$N$11:$N$109,cTABUI!$D$11:$D$109,B91),0)","v":0},{"$f":"IF(B91<>\"\",SUMIFS(cTABUI!$O$11:$O$109,cTABUI!$D$11:$D$109,B91),0)","v":0}]
[null,{"$f":"IF(iCONDOMINI!B92<>\"\",iCONDOMINI!B92,\"\")","v":"C82"},{"$f":"IF(iCONDOMINI!C92<>\"\",iCONDOMINI!C92,\"\")","v":""},{"$f":"IF(B92<>\"\",SUMIFS(cTABUI!$F$11:$F$109,cTABUI!$D$11:$D$109,B92),0)","v":0},{"$f":"IF(B92<>\"\",SUMIFS(cTABUI!$G$11:$G$109,cTABUI!$D$11:$D$109,B92),0)","v":0},{"$f":"IF(B92<>\"\",SUMIFS(cTABUI!$H$11:$H$109,cTABUI!$D$11:$D$109,B92),0)","v":0},{"$f":"IF(B92<>\"\",SUMIFS(cTABUI!$I$11:$I$109,cTABUI!$D$11:$D$109,B92),0)","v":0},{"$f":"IF(B92<>\"\",SUMIFS(cTABUI!$J$11:$J$109,cTABUI!$D$11:$D$109,B92),0)","v":0},{"$f":"IF(B92<>\"\",SUMIFS(cTABUI!$K$11:$K$109,cTABUI!$D$11:$D$109,B92),0)","v":0},{"$f":"IF(B92<>\"\",SUMIFS(cTABUI!$L$11:$L$109,cTABUI!$D$11:$D$109,B92),0)","v":0},{"$f":"IF(B92<>\"\",SUMIFS(cTABUI!$M$11:$M$109,cTABUI!$D$11:$D$109,B92),0)","v":0},{"$f":"IF(B92<>\"\",SUMIFS(cTABUI!$N$11:$N$109,cTABUI!$D$11:$D$109,B92),0)","v":0},{"$f":"IF(B92<>\"\",SUMIFS(cTABUI!$O$11:$O$109,cTABUI!$D$11:$D$109,B92),0)","v":0}]
[null,{"$f":"IF(iCONDOMINI!B93<>\"\",iCONDOMINI!B93,\"\")","v":"C83"},{"$f":"IF(iCONDOMINI!C93<>\"\",iCONDOMINI!C93,\"\")","v":""},{"$f":"IF(B93<>\"\",SUMIFS(cTABUI!$F$11:$F$109,cTABUI!$D$11:$D$109,B93),0)","v":0},{"$f":"IF(B93<>\"\",SUMIFS(cTABUI!$G$11:$G$109,cTABUI!$D$11:$D$109,B93),0)","v":0},{"$f":"IF(B93<>\"\",SUMIFS(cTABUI!$H$11:$H$109,cTABUI!$D$11:$D$109,B93),0)","v":0},{"$f":"IF(B93<>\"\",SUMIFS(cTABUI!$I$11:$I$109,cTABUI!$D$11:$D$109,B93),0)","v":0},{"$f":"IF(B93<>\"\",SUMIFS(cTABUI!$J$11:$J$109,cTABUI!$D$11:$D$109,B93),0)","v":0},{"$f":"IF(B93<>\"\",SUMIFS(cTABUI!$K$11:$K$109,cTABUI!$D$11:$D$109,B93),0)","v":0},{"$f":"IF(B93<>\"\",SUMIFS(cTABUI!$L$11:$L$109,cTABUI!$D$11:$D$109,B93),0)","v":0},{"$f":"IF(B93<>\"\",SUMIFS(cTABUI!$M$11:$M$109,cTABUI!$D$11:$D$109,B93),0)","v":0},{"$f":"IF(B93<>\"\",SUMIFS(cTABUI!$N$11:$N$109,cTABUI!$D$11:$D$109,B93),0)","v":0},{"$f":"IF(B93<>\"\",SUMIFS(cTABUI!$O$11:$O$109,cTABUI!$D$11:$D$109,B93),0)","v":0}]
[null,{"$f":"IF(iCONDOMINI!B94<>\"\",iCONDOMINI!B94,\"\")","v":"C84"},{"$f":"IF(iCONDOMINI!C94<>\"\",iCONDOMINI!C94,\"\")","v":""},{"$f":"IF(B94<>\"\",SUMIFS(cTABUI!$F$11:$F$109,cTABUI!$D$11:$D$109,B94),0)","v":0},{"$f":"IF(B94<>\"\",SUMIFS(cTABUI!$G$11:$G$109,cTABUI!$D$11:$D$109,B94),0)","v":0},{"$f":"IF(B94<>\"\",SUMIFS(cTABUI!$H$11:$H$109,cTABUI!$D$11:$D$109,B94),0)","v":0},{"$f":"IF(B94<>\"\",SUMIFS(cTABUI!$I$11:$I$109,cTABUI!$D$11:$D$109,B94),0)","v":0},{"$f":"IF(B94<>\"\",SUMIFS(cTABUI!$J$11:$J$109,cTABUI!$D$11:$D$109,B94),0)","v":0},{"$f":"IF(B94<>\"\",SUMIFS(cTABUI!$K$11:$K$109,cTABUI!$D$11:$D$109,B94),0)","v":0},{"$f":"IF(B94<>\"\",SUMIFS(cTABUI!$L$11:$L$109,cTABUI!$D$11:$D$109,B94),0)","v":0},{"$f":"IF(B94<>\"\",SUMIFS(cTABUI!$M$11:$M$109,cTABUI!$D$11:$D$109,B94),0)","v":0},{"$f":"IF(B94<>\"\",SUMIFS(cTABUI!$N$11:$N$109,cTABUI!$D$11:$D$109,B94),0)","v":0},{"$f":"IF(B94<>\"\",SUMIFS(cTABUI!$O$11:$O$109,cTABUI!$D$11:$D$109,B94),0)","v":0}]
[null,{"$f":"IF(iCONDOMINI!B95<>\"\",iCONDOMINI!B95,\"\")","v":"C85"},{"$f":"IF(iCONDOMINI!C95<>\"\",iCONDOMINI!C95,\"\")","v":""},{"$f":"IF(B95<>\"\",SUMIFS(cTABUI!$F$11:$F$109,cTABUI!$D$11:$D$109,B95),0)","v":0},{"$f":"IF(B95<>\"\",SUMIFS(cTABUI!$G$11:$G$109,cTABUI!$D$11:$D$109,B95),0)","v":0},{"$f":"IF(B95<>\"\",SUMIFS(cTABUI!$H$11:$H$109,cTABUI!$D$11:$D$109,B95),0)","v":0},{"$f":"IF(B95<>\"\",SUMIFS(cTABUI!$I$11:$I$109,cTABUI!$D$11:$D$109,B95),0)","v":0},{"$f":"IF(B95<>\"\",SUMIFS(cTABUI!$J$11:$J$109,cTABUI!$D$11:$D$109,B95),0)","v":0},{"$f":"IF(B95<>\"\",SUMIFS(cTABUI!$K$11:$K$109,cTABUI!$D$11:$D$109,B95),0)","v":0},{"$f":"IF(B95<>\"\",SUMIFS(cTABUI!$L$11:$L$109,cTABUI!$D$11:$D$109,B95),0)","v":0},{"$f":"IF(B95<>\"\",SUMIFS(cTABUI!$M$11:$M$109,cTABUI!$D$11:$D$109,B95),0)","v":0},{"$f":"IF(B95<>\"\",SUMIFS(cTABUI!$N$11:$N$109,cTABUI!$D$11:$D$109,B95),0)","v":0},{"$f":"IF(B95<>\"\",SUMIFS(cTABUI!$O$11:$O$109,cTABUI!$D$11:$D$109,B95),0)","v":0}]
[null,{"$f":"IF(iCONDOMINI!B96<>\"\",iCONDOMINI!B96,\"\")","v":"C86"},{"$f":"IF(iCONDOMINI!C96<>\"\",iCONDOMINI!C96,\"\")","v":""},{"$f":"IF(B96<>\"\",SUMIFS(cTABUI!$F$11:$F$109,cTABUI!$D$11:$D$109,B96),0)","v":0},{"$f":"IF(B96<>\"\",SUMIFS(cTABUI!$G$11:$G$109,cTABUI!$D$11:$D$109,B96),0)","v":0},{"$f":"IF(B96<>\"\",SUMIFS(cTABUI!$H$11:$H$109,cTABUI!$D$11:$D$109,B96),0)","v":0},{"$f":"IF(B96<>\"\",SUMIFS(cTABUI!$I$11:$I$109,cTABUI!$D$11:$D$109,B96),0)","v":0},{"$f":"IF(B96<>\"\",SUMIFS(cTABUI!$J$11:$J$109,cTABUI!$D$11:$D$109,B96),0)","v":0},{"$f":"IF(B96<>\"\",SUMIFS(cTABUI!$K$11:$K$109,cTABUI!$D$11:$D$109,B96),0)","v":0},{"$f":"IF(B96<>\"\",SUMIFS(cTABUI!$L$11:$L$109,cTABUI!$D$11:$D$109,B96),0)","v":0},{"$f":"IF(B96<>\"\",SUMIFS(cTABUI!$M$11:$M$109,cTABUI!$D$11:$D$109,B96),0)","v":0},{"$f":"IF(B96<>\"\",SUMIFS(cTABUI!$N$11:$N$109,cTABUI!$D$11:$D$109,B96),0)","v":0},{"$f":"IF(B96<>\"\",SUMIFS(cTABUI!$O$11:$O$109,cTABUI!$D$11:$D$109,B96),0)","v":0}]
[null,{"$f":"IF(iCONDOMINI!B97<>\"\",iCONDOMINI!B97,\"\")","v":"C87"},{"$f":"IF(iCONDOMINI!C97<>\"\",iCONDOMINI!C97,\"\")","v":""},{"$f":"IF(B97<>\"\",SUMIFS(cTABUI!$F$11:$F$109,cTABUI!$D$11:$D$109,B97),0)","v":0},{"$f":"IF(B97<>\"\",SUMIFS(cTABUI!$G$11:$G$109,cTABUI!$D$11:$D$109,B97),0)","v":0},{"$f":"IF(B97<>\"\",SUMIFS(cTABUI!$H$11:$H$109,cTABUI!$D$11:$D$109,B97),0)","v":0},{"$f":"IF(B97<>\"\",SUMIFS(cTABUI!$I$11:$I$109,cTABUI!$D$11:$D$109,B97),0)","v":0},{"$f":"IF(B97<>\"\",SUMIFS(cTABUI!$J$11:$J$109,cTABUI!$D$11:$D$109,B97),0)","v":0},{"$f":"IF(B97<>\"\",SUMIFS(cTABUI!$K$11:$K$109,cTABUI!$D$11:$D$109,B97),0)","v":0},{"$f":"IF(B97<>\"\",SUMIFS(cTABUI!$L$11:$L$109,cTABUI!$D$11:$D$109,B97),0)","v":0},{"$f":"IF(B97<>\"\",SUMIFS(cTABUI!$M$11:$M$109,cTABUI!$D$11:$D$109,B97),0)","v":0},{"$f":"IF(B97<>\"\",SUMIFS(cTABUI!$N$11:$N$109,cTABUI!$D$11:$D$109,B97),0)","v":0},{"$f":"IF(B97<>\"\",SUMIFS(cTABUI!$O$11:$O$109,cTABUI!$D$11:$D$109,B97),0)","v":0}]
[null,{"$f":"IF(iCONDOMINI!B98<>\"\",iCONDOMINI!B98,\"\")","v":"C88"},{"$f":"IF(iCONDOMINI!C98<>\"\",iCONDOMINI!C98,\"\")","v":""},{"$f":"IF(B98<>\"\",SUMIFS(cTABUI!$F$11:$F$109,cTABUI!$D$11:$D$109,B98),0)","v":0},{"$f":"IF(B98<>\"\",SUMIFS(cTABUI!$G$11:$G$109,cTABUI!$D$11:$D$109,B98),0)","v":0},{"$f":"IF(B98<>\"\",SUMIFS(cTABUI!$H$11:$H$109,cTABUI!$D$11:$D$109,B98),0)","v":0},{"$f":"IF(B98<>\"\",SUMIFS(cTABUI!$I$11:$I$109,cTABUI!$D$11:$D$109,B98),0)","v":0},{"$f":"IF(B98<>\"\",SUMIFS(cTABUI!$J$11:$J$109,cTABUI!$D$11:$D$109,B98),0)","v":0},{"$f":"IF(B98<>\"\",SUMIFS(cTABUI!$K$11:$K$109,cTABUI!$D$11:$D$109,B98),0)","v":0},{"$f":"IF(B98<>\"\",SUMIFS(cTABUI!$L$11:$L$109,cTABUI!$D$11:$D$109,B98),0)","v":0},{"$f":"IF(B98<>\"\",SUMIFS(cTABUI!$M$11:$M$109,cTABUI!$D$11:$D$109,B98),0)","v":0},{"$f":"IF(B98<>\"\",SUMIFS(cTABUI!$N$11:$N$109,cTABUI!$D$11:$D$109,B98),0)","v":0},{"$f":"IF(B98<>\"\",SUMIFS(cTABUI!$O$11:$O$109,cTABUI!$D$11:$D$109,B98),0)","v":0}]
[null,{"$f":"IF(iCONDOMINI!B99<>\"\",iCONDOMINI!B99,\"\")","v":"C89"},{"$f":"IF(iCONDOMINI!C99<>\"\",iCONDOMINI!C99,\"\")","v":""},{"$f":"IF(B99<>\"\",SUMIFS(cTABUI!$F$11:$F$109,cTABUI!$D$11:$D$109,B99),0)","v":0},{"$f":"IF(B99<>\"\",SUMIFS(cTABUI!$G$11:$G$109,cTABUI!$D$11:$D$109,B99),0)","v":0},{"$f":"IF(B99<>\"\",SUMIFS(cTABUI!$H$11:$H$109,cTABUI!$D$11:$D$109,B99),0)","v":0},{"$f":"IF(B99<>\"\",SUMIFS(cTABUI!$I$11:$I$109,cTABUI!$D$11:$D$109,B99),0)","v":0},{"$f":"IF(B99<>\"\",SUMIFS(cTABUI!$J$11:$J$109,cTABUI!$D$11:$D$109,B99),0)","v":0},{"$f":"IF(B99<>\"\",SUMIFS(cTABUI!$K$11:$K$109,cTABUI!$D$11:$D$109,B99),0)","v":0},{"$f":"IF(B99<>\"\",SUMIFS(cTABUI!$L$11:$L$109,cTABUI!$D$11:$D$109,B99),0)","v":0},{"$f":"IF(B99<>\"\",SUMIFS(cTABUI!$M$11:$M$109,cTABUI!$D$11:$D$109,B99),0)","v":0},{"$f":"IF(B99<>\"\",SUMIFS(cTABUI!$N$11:$N$109,cTABUI!$D$11:$D$109,B99),0)","v":0},{"$f":"IF(B99<>\"\",SUMIFS(cTABUI!$O$11:$O$109,cTABUI!$D$11:$D$109,B99),0)","v":0}]
[null,{"$f":"IF(iCONDOMINI!B100<>\"\",iCONDOMINI!B100,\"\")","v":"C90"},{"$f":"IF(iCONDOMINI!C100<>\"\",iCONDOMINI!C100,\"\")","v":""},{"$f":"IF(B100<>\"\",SUMIFS(cTABUI!$F$11:$F$109,cTABUI!$D$11:$D$109,B100),0)","v":0},{"$f":"IF(B100<>\"\",SUMIFS(cTABUI!$G$11:$G$109,cTABUI!$D$11:$D$109,B100),0)","v":0},{"$f":"IF(B100<>\"\",SUMIFS(cTABUI!$H$11:$H$109,cTABUI!$D$11:$D$109,B100),0)","v":0},{"$f":"IF(B100<>\"\",SUMIFS(cTABUI!$I$11:$I$109,cTABUI!$D$11:$D$109,B100),0)","v":0},{"$f":"IF(B100<>\"\",SUMIFS(cTABUI!$J$11:$J$109,cTABUI!$D$11:$D$109,B100),0)","v":0},{"$f":"IF(B100<>\"\",SUMIFS(cTABUI!$K$11:$K$109,cTABUI!$D$11:$D$109,B100),0)","v":0},{"$f":"IF(B100<>\"\",SUMIFS(cTABUI!$L$11:$L$109,cTABUI!$D$11:$D$109,B100),0)","v":0},{"$f":"IF(B100<>\"\",SUMIFS(cTABUI!$M$11:$M$109,cTABUI!$D$11:$D$109,B100),0)","v":0},{"$f":"IF(B100<>\"\",SUMIFS(cTABUI!$N$11:$N$109,cTABUI!$D$11:$D$109,B100),0)","v":0},{"$f":"IF(B100<>\"\",SUMIFS(cTABUI!$O$11:$O$109,cTABUI!$D$11:$D$109,B100),0)","v":0}]
[null,{"$f":"IF(iCONDOMINI!B101<>\"\",iCONDOMINI!B101,\"\")","v":"C91"},{"$f":"IF(iCONDOMINI!C101<>\"\",iCONDOMINI!C101,\"\")","v":""},{"$f":"IF(B101<>\"\",SUMIFS(cTABUI!$F$11:$F$109,cTABUI!$D$11:$D$109,B101),0)","v":0},{"$f":"IF(B101<>\"\",SUMIFS(cTABUI!$G$11:$G$109,cTABUI!$D$11:$D$109,B101),0)","v":0},{"$f":"IF(B101<>\"\",SUMIFS(cTABUI!$H$11:$H$109,cTABUI!$D$11:$D$109,B101),0)","v":0},{"$f":"IF(B101<>\"\",SUMIFS(cTABUI!$I$11:$I$109,cTABUI!$D$11:$D$109,B101),0)","v":0},{"$f":"IF(B101<>\"\",SUMIFS(cTABUI!$J$11:$J$109,cTABUI!$D$11:$D$109,B101),0)","v":0},{"$f":"IF(B101<>\"\",SUMIFS(cTABUI!$K$11:$K$109,cTABUI!$D$11:$D$109,B101),0)","v":0},{"$f":"IF(B101<>\"\",SUMIFS(cTABUI!$L$11:$L$109,cTABUI!$D$11:$D$109,B101),0)","v":0},{"$f":"IF(B101<>\"\",SUMIFS(cTABUI!$M$11:$M$109,cTABUI!$D$11:$D$109,B101),0)","v":0},{"$f":"IF(B101<>\"\",SUMIFS(cTABUI!$N$11:$N$109,cTABUI!$D$11:$D$109,B101),0)","v":0},{"$f":"IF(B101<>\"\",SUMIFS(cTABUI!$O$11:$O$109,cTABUI!$D$11:$D$109,B101),0)","v":0}]
[null,{"$f":"IF(iCONDOMINI!B102<>\"\",iCONDOMINI!B102,\"\")","v":"C92"},{"$f":"IF(iCONDOMINI!C102<>\"\",iCONDOMINI!C102,\"\")","v":""},{"$f":"IF(B102<>\"\",SUMIFS(cTABUI!$F$11:$F$109,cTABUI!$D$11:$D$109,B102),0)","v":0},{"$f":"IF(B102<>\"\",SUMIFS(cTABUI!$G$11:$G$109,cTABUI!$D$11:$D$109,B102),0)","v":0},{"$f":"IF(B102<>\"\",SUMIFS(cTABUI!$H$11:$H$109,cTABUI!$D$11:$D$109,B102),0)","v":0},{"$f":"IF(B102<>\"\",SUMIFS(cTABUI!$I$11:$I$109,cTABUI!$D$11:$D$109,B102),0)","v":0},{"$f":"IF(B102<>\"\",SUMIFS(cTABUI!$J$11:$J$109,cTABUI!$D$11:$D$109,B102),0)","v":0},{"$f":"IF(B102<>\"\",SUMIFS(cTABUI!$K$11:$K$109,cTABUI!$D$11:$D$109,B102),0)","v":0},{"$f":"IF(B102<>\"\",SUMIFS(cTABUI!$L$11:$L$109,cTABUI!$D$11:$D$109,B102),0)","v":0},{"$f":"IF(B102<>\"\",SUMIFS(cTABUI!$M$11:$M$109,cTABUI!$D$11:$D$109,B102),0)","v":0},{"$f":"IF(B102<>\"\",SUMIFS(cTABUI!$N$11:$N$109,cTABUI!$D$11:$D$109,B102),0)","v":0},{"$f":"IF(B102<>\"\",SUMIFS(cTABUI!$O$11:$O$109,cTABUI!$D$11:$D$109,B102),0)","v":0}]
[null,{"$f":"IF(iCONDOMINI!B103<>\"\",iCONDOMINI!B103,\"\")","v":"C93"},{"$f":"IF(iCONDOMINI!C103<>\"\",iCONDOMINI!C103,\"\")","v":""},{"$f":"IF(B103<>\"\",SUMIFS(cTABUI!$F$11:$F$109,cTABUI!$D$11:$D$109,B103),0)","v":0},{"$f":"IF(B103<>\"\",SUMIFS(cTABUI!$G$11:$G$109,cTABUI!$D$11:$D$109,B103),0)","v":0},{"$f":"IF(B103<>\"\",SUMIFS(cTABUI!$H$11:$H$109,cTABUI!$D$11:$D$109,B103),0)","v":0},{"$f":"IF(B103<>\"\",SUMIFS(cTABUI!$I$11:$I$109,cTABUI!$D$11:$D$109,B103),0)","v":0},{"$f":"IF(B103<>\"\",SUMIFS(cTABUI!$J$11:$J$109,cTABUI!$D$11:$D$109,B103),0)","v":0},{"$f":"IF(B103<>\"\",SUMIFS(cTABUI!$K$11:$K$109,cTABUI!$D$11:$D$109,B103),0)","v":0},{"$f":"IF(B103<>\"\",SUMIFS(cTABUI!$L$11:$L$109,cTABUI!$D$11:$D$109,B103),0)","v":0},{"$f":"IF(B103<>\"\",SUMIFS(cTABUI!$M$11:$M$109,cTABUI!$D$11:$D$109,B103),0)","v":0},{"$f":"IF(B103<>\"\",SUMIFS(cTABUI!$N$11:$N$109,cTABUI!$D$11:$D$109,B103),0)","v":0},{"$f":"IF(B103<>\"\",SUMIFS(cTABUI!$O$11:$O$109,cTABUI!$D$11:$D$109,B103),0)","v":0}]
[null,{"$f":"IF(iCONDOMINI!B104<>\"\",iCONDOMINI!B104,\"\")","v":"C94"},{"$f":"IF(iCONDOMINI!C104<>\"\",iCONDOMINI!C104,\"\")","v":""},{"$f":"IF(B104<>\"\",SUMIFS(cTABUI!$F$11:$F$109,cTABUI!$D$11:$D$109,B104),0)","v":0},{"$f":"IF(B104<>\"\",SUMIFS(cTABUI!$G$11:$G$109,cTABUI!$D$11:$D$109,B104),0)","v":0},{"$f":"IF(B104<>\"\",SUMIFS(cTABUI!$H$11:$H$109,cTABUI!$D$11:$D$109,B104),0)","v":0},{"$f":"IF(B104<>\"\",SUMIFS(cTABUI!$I$11:$I$109,cTABUI!$D$11:$D$109,B104),0)","v":0},{"$f":"IF(B104<>\"\",SUMIFS(cTABUI!$J$11:$J$109,cTABUI!$D$11:$D$109,B104),0)","v":0},{"$f":"IF(B104<>\"\",SUMIFS(cTABUI!$K$11:$K$109,cTABUI!$D$11:$D$109,B104),0)","v":0},{"$f":"IF(B104<>\"\",SUMIFS(cTABUI!$L$11:$L$109,cTABUI!$D$11:$D$109,B104),0)","v":0},{"$f":"IF(B104<>\"\",SUMIFS(cTABUI!$M$11:$M$109,cTABUI!$D$11:$D$109,B104),0)","v":0},{"$f":"IF(B104<>\"\",SUMIFS(cTABUI!$N$11:$N$109,cTABUI!$D$11:$D$109,B104),0)","v":0},{"$f":"IF(B104<>\"\",SUMIFS(cTABUI!$O$11:$O$109,cTABUI!$D$11:$D$109,B104),0)","v":0}]
[null,{"$f":"IF(iCONDOMINI!B105<>\"\",iCONDOMINI!B105,\"\")","v":"C95"},{"$f":"IF(iCONDOMINI!C105<>\"\",iCONDOMINI!C105,\"\")","v":""},{"$f":"IF(B105<>\"\",SUMIFS(cTABUI!$F$11:$F$109,cTABUI!$D$11:$D$109,B105),0)","v":0},{"$f":"IF(B105<>\"\",SUMIFS(cTABUI!$G$11:$G$109,cTABUI!$D$11:$D$109,B105),0)","v":0},{"$f":"IF(B105<>\"\",SUMIFS(cTABUI!$H$11:$H$109,cTABUI!$D$11:$D$109,B105),0)","v":0},{"$f":"IF(B105<>\"\",SUMIFS(cTABUI!$I$11:$I$109,cTABUI!$D$11:$D$109,B105),0)","v":0},{"$f":"IF(B105<>\"\",SUMIFS(cTABUI!$J$11:$J$109,cTABUI!$D$11:$D$109,B105),0)","v":0},{"$f":"IF(B105<>\"\",SUMIFS(cTABUI!$K$11:$K$109,cTABUI!$D$11:$D$109,B105),0)","v":0},{"$f":"IF(B105<>\"\",SUMIFS(cTABUI!$L$11:$L$109,cTABUI!$D$11:$D$109,B105),0)","v":0},{"$f":"IF(B105<>\"\",SUMIFS(cTABUI!$M$11:$M$109,cTABUI!$D$11:$D$109,B105),0)","v":0},{"$f":"IF(B105<>\"\",SUMIFS(cTABUI!$N$11:$N$109,cTABUI!$D$11:$D$109,B105),0)","v":0},{"$f":"IF(B105<>\"\",SUMIFS(cTABUI!$O$11:$O$109,cTABUI!$D$11:$D$109,B105),0)","v":0}]
[null,{"$f":"IF(iCONDOMINI!B106<>\"\",iCONDOMINI!B106,\"\")","v":"C96"},{"$f":"IF(iCONDOMINI!C106<>\"\",iCONDOMINI!C106,\"\")","v":""},{"$f":"IF(B106<>\"\",SUMIFS(cTABUI!$F$11:$F$109,cTABUI!$D$11:$D$109,B106),0)","v":0},{"$f":"IF(B106<>\"\",SUMIFS(cTABUI!$G$11:$G$109,cTABUI!$D$11:$D$109,B106),0)","v":0},{"$f":"IF(B106<>\"\",SUMIFS(cTABUI!$H$11:$H$109,cTABUI!$D$11:$D$109,B106),0)","v":0},{"$f":"IF(B106<>\"\",SUMIFS(cTABUI!$I$11:$I$109,cTABUI!$D$11:$D$109,B106),0)","v":0},{"$f":"IF(B106<>\"\",SUMIFS(cTABUI!$J$11:$J$109,cTABUI!$D$11:$D$109,B106),0)","v":0},{"$f":"IF(B106<>\"\",SUMIFS(cTABUI!$K$11:$K$109,cTABUI!$D$11:$D$109,B106),0)","v":0},{"$f":"IF(B106<>\"\",SUMIFS(cTABUI!$L$11:$L$109,cTABUI!$D$11:$D$109,B106),0)","v":0},{"$f":"IF(B106<>\"\",SUMIFS(cTABUI!$M$11:$M$109,cTABUI!$D$11:$D$109,B106),0)","v":0},{"$f":"IF(B106<>\"\",SUMIFS(cTABUI!$N$11:$N$109,cTABUI!$D$11:$D$109,B106),0)","v":0},{"$f":"IF(B106<>\"\",SUMIFS(cTABUI!$O$11:$O$109,cTABUI!$D$11:$D$109,B106),0)","v":0}]
[null,{"$f":"IF(iCONDOMINI!B107<>\"\",iCONDOMINI!B107,\"\")","v":"C97"},{"$f":"IF(iCONDOMINI!C107<>\"\",iCONDOMINI!C107,\"\")","v":""},{"$f":"IF(B107<>\"\",SUMIFS(cTABUI!$F$11:$F$109,cTABUI!$D$11:$D$109,B107),0)","v":0},{"$f":"IF(B107<>\"\",SUMIFS(cTABUI!$G$11:$G$109,cTABUI!$D$11:$D$109,B107),0)","v":0},{"$f":"IF(B107<>\"\",SUMIFS(cTABUI!$H$11:$H$109,cTABUI!$D$11:$D$109,B107),0)","v":0},{"$f":"IF(B107<>\"\",SUMIFS(cTABUI!$I$11:$I$109,cTABUI!$D$11:$D$109,B107),0)","v":0},{"$f":"IF(B107<>\"\",SUMIFS(cTABUI!$J$11:$J$109,cTABUI!$D$11:$D$109,B107),0)","v":0},{"$f":"IF(B107<>\"\",SUMIFS(cTABUI!$K$11:$K$109,cTABUI!$D$11:$D$109,B107),0)","v":0},{"$f":"IF(B107<>\"\",SUMIFS(cTABUI!$L$11:$L$109,cTABUI!$D$11:$D$109,B107),0)","v":0},{"$f":"IF(B107<>\"\",SUMIFS(cTABUI!$M$11:$M$109,cTABUI!$D$11:$D$109,B107),0)","v":0},{"$f":"IF(B107<>\"\",SUMIFS(cTABUI!$N$11:$N$109,cTABUI!$D$11:$D$109,B107),0)","v":0},{"$f":"IF(B107<>\"\",SUMIFS(cTABUI!$O$11:$O$109,cTABUI!$D$11:$D$109,B107),0)","v":0}]
[null,{"$f":"IF(iCONDOMINI!B108<>\"\",iCONDOMINI!B108,\"\")","v":"C98"},{"$f":"IF(iCONDOMINI!C108<>\"\",iCONDOMINI!C108,\"\")","v":""},{"$f":"IF(B108<>\"\",SUMIFS(cTABUI!$F$11:$F$109,cTABUI!$D$11:$D$109,B108),0)","v":0},{"$f":"IF(B108<>\"\",SUMIFS(cTABUI!$G$11:$G$109,cTABUI!$D$11:$D$109,B108),0)","v":0},{"$f":"IF(B108<>\"\",SUMIFS(cTABUI!$H$11:$H$109,cTABUI!$D$11:$D$109,B108),0)","v":0},{"$f":"IF(B108<>\"\",SUMIFS(cTABUI!$I$11:$I$109,cTABUI!$D$11:$D$109,B108),0)","v":0},{"$f":"IF(B108<>\"\",SUMIFS(cTABUI!$J$11:$J$109,cTABUI!$D$11:$D$109,B108),0)","v":0},{"$f":"IF(B108<>\"\",SUMIFS(cTABUI!$K$11:$K$109,cTABUI!$D$11:$D$109,B108),0)","v":0},{"$f":"IF(B108<>\"\",SUMIFS(cTABUI!$L$11:$L$109,cTABUI!$D$11:$D$109,B108),0)","v":0},{"$f":"IF(B108<>\"\",SUMIFS(cTABUI!$M$11:$M$109,cTABUI!$D$11:$D$109,B108),0)","v":0},{"$f":"IF(B108<>\"\",SUMIFS(cTABUI!$N$11:$N$109,cTABUI!$D$11:$D$109,B108),0)","v":0},{"$f":"IF(B108<>\"\",SUMIFS(cTABUI!$O$11:$O$109,cTABUI!$D$11:$D$109,B108),0)","v":0}]
[null,{"$f":"IF(iCONDOMINI!B109<>\"\",iCONDOMINI!B109,\"\")","v":"C99"},{"$f":"IF(iCONDOMINI!C109<>\"\",iCONDOMINI!C109,\"\")","v":""},{"$f":"IF(B109<>\"\",SUMIFS(cTABUI!$F$11:$F$109,cTABUI!$D$11:$D$109,B109),0)","v":0},{"$f":"IF(B109<>\"\",SUMIFS(cTABUI!$G$11:$G$109,cTABUI!$D$11:$D$109,B109),0)","v":0},{"$f":"IF(B109<>\"\",SUMIFS(cTABUI!$H$11:$H$109,cTABUI!$D$11:$D$109,B109),0)","v":0},{"$f":"IF(B109<>\"\",SUMIFS(cTABUI!$I$11:$I$109,cTABUI!$D$11:$D$109,B109),0)","v":0},{"$f":"IF(B109<>\"\",SUMIFS(cTABUI!$J$11:$J$109,cTABUI!$D$11:$D$109,B109),0)","v":0},{"$f":"IF(B109<>\"\",SUMIFS(cTABUI!$K$11:$K$109,cTABUI!$D$11:$D$109,B109),0)","v":0},{"$f":"IF(B109<>\"\",SUMIFS(cTABUI!$L$11:$L$109,cTABUI!$D$11:$D$109,B109),0)","v":0},{"$f":"IF(B109<>\"\",SUMIFS(cTABUI!$M$11:$M$109,cTABUI!$D$11:$D$109,B109),0)","v":0},{"$f":"IF(B109<>\"\",SUMIFS(cTABUI!$N$11:$N$109,cTABUI!$D$11:$D$109,B109),0)","v":0},{"$f":"IF(B109<>\"\",SUMIFS(cTABUI!$O$11:$O$109,cTABUI!$D$11:$D$109,B109),0)","v":0}]
[null,null,"TOTALI",{"$f":"SUM(D11:D109)","v":1000},{"$f":"SUM(E11:E109)","v":1000.0000000000002},1000.0000000000002,1000,1000,{"$f":"SUM(I11:I109)","v":0},0,0,0,0]

{"sheet":"hEsempiScrittureContabili","index":18,"n_rows":192,"n_cols":14,"rows_kept":192,"cut":false,"hidden":true,"merged":[[75,0,75,13],[0,0,0,13],[1,1,2,3],[1,4,2,4],[1,13,2,13],[5,0,5,13],[36,0,36,13],[37,0,37,13],[46,0,46,13],[55,0,55,13],[64,0,64,13],[67,0,67,13],[138,0,138,13],[89,0,89,13],[92,0,92,13],[95,0,95,13],[96,0,96,13],[101,0,101,13],[112,0,112,13],[121,0,121,13],[125,4,125,12],[126,4,126,12],[134,0,134,13],[135,4,135,12],[187,0,187,13],[145,0,145,13],[152,0,152,13],[154,0,154,13],[155,0,155,13],[158,0,158,13],[162,0,162,13],[163,0,163,13],[167,4,167,12],[168,4,168,12],[174,0,174,13],[182,0,182,13]]}
["ESEMPI DI REGISTRAZIONI SUL  GIORNALE CONTABILE"]
["Reg.","data",null,null,"DESCRIZIONE OPERAZIONE (e/o STRINGA INFORMATIVA)","CASSA",null,null,"CONTO CORRENTE",null,null,"MOVIMENTO",null,"Pezza\ngiustificativa "]
["n°",null,null,null,null,"ENTRATA","USCITA","SALDO","ENTRATA","USCITA","SALDO","CONTO","IMPOR."]
[null,"g","m","a"," TOTALI",null,null,null,null,null,null,null,{"$f":"IF(L4<>\"\",F4+G4+I4+J4,\"\")","v":""},"n°"]
[0,"0",0,"YYYY","=========== SCRITTURE DI APERTURA ESERCIZIO ==========\n( riporto valori da esercizio precedente)",null,null,null,null,null,null,null,{"$f":"IF(L5<>\"\",F5+G5+I5+J5,\"\")","v":""}]
["Le scritture di apertura esercizio costituiscono la registrazione n. 0 ed hanno come giorno 0 e mese 0 "]
["I",0,0,"YYYY","LIQUIDITÀ"]
["I",0,0,"YYYY","SITUAZIONE LIQUIDITÀ INIZIALE  inerente la GESTIONE ORDINARIA",1,null,1,1,null,1]
["I",0,0,"YYYY","SITUAZIONE LIQUIDITÀ FONDO nf (da ripetere per ogni fondo)",1,null,2,1,null,2]
["c",0,0,"YYYY","CREDITI"]
["c",0,0,"YYYY","CREDITI da DEPOSITI CAUZIONALI ATTIVI",null,null,2,null,null,2]
["c",0,0,"YYYY","descrizione della voce per ogni voce che presenta un credito diverso da zero",null,null,2,null,null,2,"C.01.nv.YY",1]
["c",0,0,"YYYY","CREDITI DA TERZI",null,null,2,null,null,2]
["c",0,0,"YYYY","Stringa Informativa Origine Credito",null,null,2,null,null,2,"C.02.nv.YY",1]
["c",0,0,"YYYY","da PINCO PALLINO # restituzione. pagamento in eccesso # 12 # D-03 # 12-04-2019",null,null,2,null,null,2,"C.02.01.19",1]
["c",0,0,"YYYY","CREDITI DA FONDI",null,null,2,null,null,2]
["c",0,0,"YYYY","descrizione della voce per ogni voce che presenta un credito diverso da zero",null,null,2,null,null,2,"C.03.nv.YY",1]
["c",0,0,"YYYY","CREDITI DA CONDOMINI ",null,null,2,null,null,2,null,{"$f":"IF(L18<>\"\",F18+G18+I18+J18,\"\")","v":""}]
["c",0,0,"YYYY","nome del condomino in debito verso il condominio",null,null,2,null,null,2,"C.04.nv.YY",1]
["d",0,0,"YYYY","DEBITI"]
["d",0,0,"YYYY","DEBITI VERSO CONDOMINI (per depositi cauzionali attivi)",null,null,2,null,null,2]
["d",0,0,"YYYY","descrizione della voce per ogni voce che presenta un debito diverso da zero",null,null,2,null,null,2,"D.01.nv.YY",1]
["d",0,0,"YYYY","DEBITO v/s TERZI PRIVATI",null,null,2,null,null,2]
["d",0,0,"YYYY","Stringa Informativa Origine Debito",null,null,2,null,null,2,"D.02.nv.YY",1]
["d",0,0,"YYYY","v/s PINCO PALLINO # ricevuta fattura n. 46/19  # 12 # C-01 # 12-04-2019",null,null,2,null,null,2,"D.02.01.19",1]
["d",0,0,"YYYY","DEBITO v/s ERARIO e ENTI PUBBLICI ",null,null,2,null,null,2]
["d",0,0,"YYYY","Stringa Informativa Origine Debito",null,null,2,null,null,2,"D.03.nv.YY",1]
["d",0,0,"YYYY","v/s ERARIO # R.A. su pag. fattura n. 56/19 a PINCO PALLINO  # 05 # C-08 # 12-01-2019",null,null,2,null,null,2,"D.03.01.19",1]
["d",0,0,"YYYY","DEBITI VERSO CONDOMINI (per quote in eccesso esercizio prec.)",null,null,2,null,null,2]
["d",0,0,"YYYY","nome del condomino in credito dal condominio",null,null,2,null,null,2,"D.04.nc",1]
["s",1,1,"YYYY","OPERAZIONI DI STORNO"]
["s",1,1,"YYYY","Restituzione quota in eccesso esercizio precedente al condomino",null,null,2,null,null,2,"U.01.nc",1]
["s",1,1,"YYYY","Stringa Informativa Incasso da Condomino",null,null,2,null,null,2,"Q.01.nc",{"$f":"M32","v":1}]
["s",1,1,"YYYY","Restituzione a PINCO PALLINO",null,null,2,null,null,2,"U.01.19",1]
["s",1,1,"YYYY","PINCO PALLINO  # Storno credito in versamento quota esercizio corrente ",null,null,2,null,null,2,"Q.01.19",1]
["e",1,1,"YYYY","=========== SCRITTURE IN CORSO DI ESERCIZIO ====================="]
["ENTRATE"]
["INCASSO DA CONDOMINI IN CONTO QUOTE ESERCIZIO IN CORSO (20XX)"]
[null,null,null,null,"INCASSO IN CONTANTE - ASSEGNO - BONIFICO",null,null,null,null,null,null,null,{"$f":"IF(L39<>\"\",F39+G39+I39+J39,\"\")","v":""}]
[null,null,null,null,"Stringa Informativa Incasso da Condomino",1,null,null,1,null,null,"Q.01.nc",1]
[3,8,1,"YYYY","Eredi Pinco Pallino  # Versamento in contanti in conto quota 2020 ric. 11/2020",131,null,183.42,null,null,1000,"Q.01.19",{"$f":"IF(L41<>\"\",F41+G41+I41+J41,\"\")","v":131}]
[null,null,null,null,"INCASSO CON BOLLETTINO POSTALE",null,null,null,null,null,null,null,{"$f":"IF(L42<>\"\",F42+G42+I42+J42,\"\")","v":""}]
[null,null,null,null,"Stringa Informativa Incasso da Condomino",null,null,null,1,null,null,"Q.01.nc",1]
[null,null,null,null,"Spesa personale per commissione accredito bollettino NOMECONDOMINO",null,null,null,null,0.34,null,"P.00.nc",0.36]
[9,28,1,"YYYY","Sempronio  # Versamento in contanti in conto quota 2020 ric. 31/2020",null,null,185,352.78,null,970.64,"Q.01.11",{"$f":"IF(L45<>\"\",F45+G45+I45+J45,\"\")","v":352.78}]
[10,28,1,"YYYY","spese personali SEMPRONIO per commissioni bollettino di cui sopra",null,null,null,null,0.34,970.3,"P.00.11",{"$f":"IF(L46<>\"\",F46+G46+I46+J46,\"\")","v":0.34}]
["INCASSO DA CONDOMINI IN CONTO CONGUAGLIO ESERCIZIO PRECEDENTE (20WW)"]
[null,null,null,null,"INCASSO IN CONTANTE - ASSEGNO - BONIFICO",null,null,null,null,null,null,null,{"$f":"IF(L48<>\"\",F48+G48+I48+J48,\"\")","v":""}]
[null,null,null,null,"Stringa Informativa Incasso da Condomino",1,null,null,1,null,null,"Q.02.nc",1]
[4,12,1,"YYYY","TIZIO   # Versamento con assegno in conto conguaglio 2019",90.24,null,119.17,null,null,856,"Q.02.10",{"$f":"IF(L50<>\"\",F50+G50+I50+J50,\"\")","v":90.24}]
[null,null,null,null,"INCASSO CON BOLLETTINO POSTALE",null,null,null,null,null,null,null,{"$f":"IF(L51<>\"\",F51+G51+I51+J51,\"\")","v":""}]
[null,null,null,null,"Stringa Informativa Incasso da Condomino",null,null,null,1,null,null,"Q.02.nc",1]
[null,null,null,null,"Spesa personale commissione accredito bollettino NOMECONDOMINO",null,null,null,null,0.34,null,"P.00.nc",0.36]
[19,3,2,"YYYY","SEMPRONIO  # versamento bollettino su c.c.p. in conto conguaglio esercizio 2019",null,null,null,312.45999999999998,null,526.23,"Q.02.11",{"$f":"IF(L54<>\"\",F54+G54+I54+J54,\"\")","v":312.45999999999998}]
[20,3,2,"YYYY","spese personali SEMPRONIO per commissioni bollettino di cui sopra",null,null,null,null,0.34,525.89,"P.00.11",{"$f":"IF(L55<>\"\",F55+G55+I55+J55,\"\")","v":0.34}]
["INCASSO DA CONDOMINI IN CONTO ARRETRATI ESERCIZI PRECEDENTI (20ZZ)"]
[null,null,null,null,"INCASSO IN CONTANTE - ASSEGNO - BONIFICO",null,null,null,null,null,null,null,{"$f":"IF(L57<>\"\",F57+G57+I57+J57,\"\")","v":""}]
[null,null,null,null,"Stringa Informativa Incasso da Condomino",1,null,null,1,null,null,"Q.03.nc",1]
[4,12,3,"YYYY","CAIO   # Versamento con assegno in conto arretrati esercizio 2018",90.24,null,112.24,null,null,893.12,"Q.02.14",{"$f":"IF(L59<>\"\",F59+G59+I59+J59,\"\")","v":90.24}]
[null,null,null,null,"INCASSO CON BOLLETTINO POSTALE",null,null,null,null,null,null,null,{"$f":"IF(L60<>\"\",F60+G60+I60+J60,\"\")","v":""}]
[null,null,null,null,"Stringa Informativa Incasso da Condomino",null,null,null,1,null,null,"Q.03.nc",1]
[null,null,null,null,"Spesa personale per commissione accredito bollettino NOMECONDOMINO",null,null,null,null,0.36,null,"P.00.nc",0.36]
[22,4,2,"YYYY","CICCIO BELLO  # versamento bollettino su c.c.p. in conto arretrati esercizio 2017",null,null,23.78,210.23,null,458.56,"Q.03.22",{"$f":"IF(L63<>\"\",F63+G63+I63+J63,\"\")","v":210.23}]
[23,4,2,"YYYY","spese personali CICCIO BELLO per commissioni bollettino di cui sopra",null,null,null,null,0.34,458.22,"P.00.22",{"$f":"IF(L64<>\"\",F64+G64+I64+J64,\"\")","v":0.34}]
["INCASSO DA ALTRE ENTRATE"]
[null,null,null,null,"INCASSO SU CASSA o CONTO CORRENTE"]
[null,null,null,null,"descrizione dell'operazione",1,null,null,1,null,null,"E.01.nv",1]
["INCASSO QUOTE FONDI (se la quota non era stata inserita a debito della gestione ordinaria)"]
[null,null,null,null,"VERSAMENTO su FONDO nf DIRETTAMENTE (contante. o assegno.) su cassa contante",null,null,null,null,null,null,null,{"$f":"IF(L69<>\"\",F69+G69+I69+J69,\"\")","v":""}]
[null,null,null,null,"vers. FONDO nf - condomino (ric. zz/nnnn)",1,null,null,null,null,null,"F.nf.01",1]
[null,null,null,null,"VERSAMENTO su FONDO nf BONIFICO su conto corrente",null,null,null,null,null,null,null,{"$f":"IF(L71<>\"\",F71+G71+I71+J71,\"\")","v":""}]
[null,null,null,null,"vers. FONDO nf - condomino",null,null,null,1,null,null,"F.nf.02",1]
[null,null,null,null,"VERSAMENTO su FONDO nf BOLLETTINO POSTALE su conto corrente",null,null,null,null,null,null,null,{"$f":"IF(L73<>\"\",F73+G73+I73+J73,\"\")","v":""}]
[null,null,null,null,"vers. FONDO nf - condomino ",null,null,null,1,null,null,"F.nf.02",1]
[null,null,null,null,"spesa personale commissione accredito bollettino NOMECONDOMINO",null,null,null,null,0.36,null,"P.00.nc",0.36]
["INCASSO QUOTE FONDI (se la quota era stata inserita a debito della gestione ordinaria)"]
[null,null,null,null,"VERSAMENTO FONDO nf DIRETTAMENTE (contante. o assegno.) su cassa contante",null,null,null,null,null,null,null,{"$f":"IF(L77<>\"\",F77+G77+I77+J77,\"\")","v":""}]
[null,null,null,null,"vers. FONDO nf - condomino (ric. zz/nnnn)",1,null,null,null,null,null,"F.nf.01",1]
[null,null,null,null,"diminuzione del credito della gestione ordinaria dal fondo (esercizio in corso)",null,null,null,null,null,null,"C.03.nf.EC",-1]
[null,null,null,null,"diminuzione del credito della gestione ordinaria dal fondo (esercizio precedente.)",null,null,null,null,null,null,"C.03.nf.YY",-1]
[null,null,null,null,"VERSAMENTO FONDO nf BONIFICO su conto corrente",null,null,null,null,null,null,null,{"$f":"IF(L81<>\"\",F81+G81+I81+J81,\"\")","v":""}]
[null,null,null,null,"vers. FONDO nf - condomino",null,null,null,1,null,null,"F.nf.02",1]
[null,null,null,null,"diminuzione del debito verso la gestione ordinaria (esercizio in corso)",null,null,null,null,null,null,"C.03.nf.EC",-1]
[null,null,null,null,"diminuzione del debito verso la gestione ordinaria (esercizio nn)",null,null,null,null,null,null,"C.03.nf.YY",-1]
[null,null,null,null,"VERSAMENTO FONDO nf BOLLETTINO POSTALE su conto corrente",null,null,null,null,null,null,null,{"$f":"IF(L85<>\"\",F85+G85+I85+J85,\"\")","v":""}]
[null,null,null,null,"vers. FONDO nf - condomino",null,null,null,1,null,null,"F.nf.02",1]
[null,null,null,null,"commissione accredito bollettino condomino",null,null,null,null,0.36,null,"P.00.nc",0.36]
[null,null,null,null,"diminuzione del debito verso la gestione ordinaria (esercizio in corso)",null,null,null,null,null,null,"C.03.nf.EC",-1]
[null,null,null,null,"diminuzione del debito verso la gestione ordinaria (esercizio nn)",null,null,null,null,null,null,"C.03.nf.YY",-1]
["INCASSO PRESTITO DA TERZI\n(nel versamento di quote in eccesso rispetto al preventivo da parte di un condomino, il condomino è da considerare terzo)"]
[null,null,null,null,"INCASSO SU CASSA o CONTO CORRENTE"]
[null,null,null,null,"descrizione dell'operazione",1,null,null,1,null,null,"D.02.04.EC",1]
["INCASSO DA PARTE DI UN CONDOMINO DELLE SPESE PERSONALI SOSTENUTE NELL'ESERCIZIO PER IL CONDOMINO"]
[null,null,null,null,"INCASSO SU CASSA o CONTO CORRENTE"]
[null,null,null,null,"descrizione dell'operazione",1,null,null,1,null,null,"P.00.nc",-1]
["USCITE"]
["PAGAMENTO SPESE GENERICHE su SCONTRINO, su RICEVUTA o su FATTURA PER BENI e FORNITURE (no CU e 770)\n [per operazioni non ancora inserite in contabilità]"]
[null,null,null,null,"Descrizione libera dell'operazione. [esempio: Pagamento fattura n° 125 del 10-10-2019 per acquisto prodotti di pulizia presso BricoK di Soverato)\nSe l'unico documento contabile contiene spese attribuibili a più voci, occorre inserire più righe,  ognuna delle quali contiene la descrizione della spesa, il codice del conto ed il relativo importo movimentato.\nOccorre controllare che la somma degli importi delle voci sia uguale all'importo del documento.",null,1,null,null,1,null,"S.kk.zz",1]
[11,28,1,"YYYY","Addebito preautorizzato ENEL ENERGIA scala B (fattura n 51257849/2019)",null,null,29.12,null,130.77000000000001,324.14]
[11,28,1,"YYYY","Energia Elettrica Illuminazione (40% della spesa)",null,null,29.12,null,null,324.14,"S.04.03",{"$f":"0.4*J99","v":52.308000000000007}]
[11,28,1,"YYYY","Energia Elettrica forza motrice (60% della spesa)",null,null,29.12,null,null,324.14,"S.04.08",{"$f":"J99-M100","v":78.462000000000003}]
["PAGAMENTO CONTESTUALE A RICEZIONE FATTURA o RICEVUTA PER COMPENSI PRESTAZIONI PROFESSIONALI, FORNITURE DI SERVIZI (con o senza beni) (da inserire nel 770)\n[per operazione non ancora inserita in contabilità come spesa a debito)"]
[null,null,null,null,"Ricevuta e Pagata fattura n. xxx di WWWWWWW QQQQQQ  [assegno n. nnnnnn] [bonifico]\n(L'Importo dell'uscita è dato da Importo Totale di fattura meno la Ritenuta d'acconto).\nNell'importo riportato di 106 euro si è ipotizzata una R.A del 4%",null,null,null,null,106]
[null,null,null,null,"Descrizione dell'operazione.\nL'importo della spesa è il totale di fattura, normalmente Imponibile + Spese non imponibili+IVA, ovvero nel caso di più spese con codici di conto diversi, gli importi dei singoli movimenti sono sempre come per spesa con unico codice di conto.\nNella scrittura riportata l'imponibile è 100,00, l'IVA è 10,00 e la R.A. 4,00",null,null,null,null,null,null,"S.kk.zz",110]
[null,null,null,null,"Stringa Informativa Origine Debito",null,null,null,null,null,null,"D.03.01.XX",4]
[null,null,null,null,"Stringa Informativa Scrittura per 770",null,null,null,null,null,null,"H.Pww.nf",100]
[39,16,6,"YYYY","Ricevuta e pagata Fattura PULIZIE PERFETTE (APR-MAG) n. 71/2020 del 04-06-2020",null,null,36.14,null,184.08,247.12,null,184.08]
[39,16,6,"YYYY","v/s ERARIO # R.A. su pag. fattura n. 71/20 a PULIZIE PERFETTE  # 25 # C-08 # 12-01-2020",null,null,36.14,null,null,247.12,"D.03.03.20",6.24]
[39,16,6,"YYYY","01 # F # 71/20 # 04-03-2020 # 00",null,null,36.14,null,null,247.12,"H.P04.01",156]
[39,16,6,"YYYY","Ripartizione - scala A - civico 12",null,null,36.14,null,null,247.12,"S.02.02",63.44]
[39,16,6,"YYYY","scala B - civico 18",null,null,36.14,null,null,247.12,"S.02.03",63.44]
[39,16,6,"YYYY","scala C - civico 24",null,null,36.14,null,null,247.12,"S.02.04",63.44]
["PAGAMENTO FATTURA o RICEVUTA PER COMPENSI PRESTAZIONI PROFESSIONALI, FORNITURE DI SERVIZI (con o senza beni) (da inserire nel 770)\n[per operazione già inserita in contabilità come spesa a debito)"]
[null,null,null,null,"Pagata fattura n. xxx di WWWWWWW QQQQQQ  [assegno n. nnnnnn] [bonifico]\n(L'Importo dell'uscita è dato da Importo Totale di fattura meno la Ritenuta d'acconto).\nNell'importo riportato di 106 euro si è ipotizzata una R.A del 4%",null,null,null,null,106]
[null,null,null,null,"Annullamento del relativo debito v/s WWWWWWW QQQQQQ (necessita di Stringa Informativa Debito)\nL'importo dell'annullamento è il totale di fattura.\nLa stringa è a due campi\ncampo libero # codice debito annullato",null,null,null,null,null,null,"D.02.nv.YY",110]
[null,null,null,null,"Stringa Informativa Origine Debito",null,null,null,null,null,null,"D.03.01.XX",4]
[null,null,null,null,"Stringa Informativa per 770",null,null,null,null,null,null,"H.Pww.nf",100]
[28,12,5,"YYYY","Pagata fattura PULIZIE PERFETTE n. 38 del 01-04-2020",null,null,13.46,null,92.04,621.41999999999996,null,92.04]
[28,12,5,"YYYY","Si annulla il debito v/s PULIZIE PERFETTE # 15",null,null,13.46,null,null,621.41999999999996,"D.02.01.20",-95.16]
[28,12,5,"YYYY","v/s ERARIO # R.A. su pag. fattura n. 38/20 a PULIZIE PERFETTE  # 31 # C-17 # 01-04-2020",null,null,13.46,null,null,621.41999999999996,"D.03.03.20",3.12]
[28,12,5,"YYYY","01 # F38/20 # 01-04-2020 # 00",null,null,13.46,null,null,621.41999999999996,"H.P04.01",78]
["ABBUONI SU PAGAMENTI ALL'ATTO DEL PEGAMENTO"]
[null,null,null,null,"SPESE e DEBITI dell'ESERCIZIO (diminuisce direttamente la spesa oggetto di abbuono ed il relativo debito)"]
[null,null,null,null,"diminuzione della spesa dell'importo dell'abbuono",null,null,null,null,null,null,"S.cc.nv",-1]
[null,null,null,null,"Stringa Informativa Fine Debito\ndiminuzione del debito relativo alla voce in cui ricade la spesa oggetto di abbuono",null,null,null,null,null,null,"D.02.nv.XX",-1]
[null,null,null,null,"N.B.  Le due scrittura di sopra possono essere evitate intervenendo direttamente sulle scritture della spesa e del debito precedentemente registrate, diminuendo la spesa ed il debito dell'abbuono.\nN.B. : Questo è possibile in quanto l'abbuono concerne una spesa ed un debito dell'esercizio in corso."]
[null,null,null,null,"PER SPESE ESERCIZI PRECEDENTI (l'abbuono è trattato dalla procedura come restituzione ai condomini cui era stata attribuita la spesa e contemporaneamente va a diminuire il debito del condominio per fatture ricevute e non ancora pagate)"]
[null,null,null,null,"Pagamento effettuato",null,null,null,null,95,null,"U.02.00",95]
[null,null,null,null,"Abbuono su pagamento dovuto al creditore QQQQQQQ ",null,null,null,null,null,null,"A.01.nt",5]
[null,null,null,null,"Stringa Informativa Fine Debito\nLa diminuzione dell'abbuono è inglobata direttamente nella diminuzione del debito",null,null,null,null,null,null,"D.02.nv.YY",-100]
[18,11,2,"YYYY","Pagamento debito esercizio 2019 v/s FORNITORE 01",null,null,56.23,null,27.44,423.11,"U.02.00",{"$f":"IF(L131<>\"\",F131+G131+I131+J131,\"\")","v":27.44}]
[18,11,2,"YYYY","Azzeramento del debito verso Fornitore 01 # 12",null,null,56.23,null,null,423.11,"D.02.02.19",-28.44]
[18,11,2,"YYYY","Abbuono su pagamento da ripartire su tabella D (civico 82)",null,null,56.23,null,null,423.11,"A.01.04",0.5]
[18,11,2,"YYYY","Abbuono su pagamento da ripartire su tabella E (civico 84)",null,null,56.23,null,null,423.11,"A.01.05",0.5]
["PAGAMENTO DEBITI V/S TERZI ESERCIZI PRECEDENTI (no CU e 770)"]
[null,null,null,null,"PAGAMENTO DEBITO"]
[null,null,null,null,"Pagamento debito [in conto] esercizio 20YY v/s NOMEDEBITORE ",null,1,null,null,1,null,"U.02.nv.YY",1]
[31,11,8,"YYYY","Pagamento debito esercizio 2019 v/s FORNITORE 01 (fattura 15/2019) con assegno n. 123456789",null,null,25.63,null,150,128.79,"U.02.01,19",{"$f":"IF(L138<>\"\",F138+G138+I138+J138,\"\")","v":150}]
["VERSAMENTO TRAMITE F24 DELLA R.A. SU FATTURA o RICEVUTA"]
[null,null,null,null,"Stringa Informativa Fine Debito",null,null,null,null,1,null,"D.03.01.YY",-1]
[null,null,null,null,"Stringa Informativa per 770\nÈ la stessa stringa di servizio riportata nella scrittura del pagamento della fattura o ricevuta.",null,null,null,null,null,null,"H.Rww.nf",1]
[null,null,null,null,"Eventuale Ravvedimento Operoso.\nATTENZIONE: il ravvedimento operoso deve essere posto nella riga successiva al conto H.RWW.nf, con lo stesso numero di registrazione, affinché la procedura possa correttamente riportarlo nel prospetto per il 770.",null,null,null,null,0.01,null,"S.01.nv",0.01]
[33,5,9,"YYYY","Versamento F24 per ritenuta acconto su fattura di FORNITORE01  n. 15/2020 # 26",null,null,12.4,null,15.62,524.13,"D.03.01.20",-15.62]
[33,5,9,"YYYY","01 # F # 38/20 # 01-04-2020 # 00",null,null,12.4,null,null,524.13,"H.Rww.nf",15.62]
[33,5,9,"YYYY","Ravvedimento Operoso sul versamento della R.A. di cui sopra.",null,null,12.4,null,0.12,524.01,"S.01.04",0.12]
["PAGAMENTO FATTURE UTENZE  ( con contestuale pagamento deposito cauzionale)"]
[null,null,null,null,"Pagamento fattura n. zzzzzzzzz  di QQQQQQQQQQQ (bimestre aaa-bbb)",null,null,null,null,null,null,null,{"$f":"IF(L147<>\"\",F147+G147+I147+J147,\"\")","v":""}]
[null,null,null,null,"importo totale sottratto dell'eventuale importo del deposito cauzionale",null,null,null,null,90,null,"S.kk.zz",90]
[null,null,null,null,"nel caso si paghi con la fattura un deposito cauzionale o una sua integrazione"]
[null,null,null,null,"importo per deposito cauzionale",null,null,null,null,10,null,"L.00.nv",{"$f":"IF(L150<>\"\",F150+G150+I150+J150,\"\")","v":10}]
[null,null,null,null,"deposito cauzionale - credito del condominio da QQQQQQQQQL ",null,null,null,null,null,null,"C.01.01.YY",10]
[null,null,null,null,"la procedura calcola in automatico il debito del condominio verso i condomini"]
["RICEZIONE e CONTESTUALE PAGAMENTO FATTURA PER LAVORI STRAORDINARI "]
[null,null,null,null,"Ricevuta e pagata fattura n. xxx a WWWWWWW QQQQQQ con assegno c.c. postale n. 000000000 intestato a WWWWWWWWW o tramite bonifico bancario, relativa a FONDO nf",null,null,null,null,1,null,"G.00.nf",1]
["SPOSTAMENTI DI LIQUIDITÀ"]
["SPOSTAMENTO DI LIQUIDITÀ FRA CASSA E CONTO (per somme di sola gestione ordinaria)"]
[null,null,null,null,"Movimento fra conti numerari: da cassa a banca ([vers. contante] [vers. assegni] [bonifico da amministratore])",null,1,null,1]
[null,null,null,null,"Movimento fra conti numerari: da banca a cassa ([prelievo BANCOMAT] [assegno] [contante])",1,null,null,null,1]
["SPOSTAMENTO DI LIQUIDITÀ FRA CASSA E CONTO (per somme comprendenti anche quote di fondi)"]
[null,null,null,null,"Movimento fra conti numerari (gestione FONDI): da cassa a banca ([contante] [assegni])",null,1,null,1]
[null,null,null,null,"Aumento della quota del Fondo nf sul conto bancario",null,null,null,null,null,null,"F.nf.02",1]
[null,null,null,null,"Conseguente diminuzione sulla cassa contante della quota del FONDO nf",null,null,null,null,null,null,"F.nf.01",-1]
["SCRITTURE  VARIE SENZA VARIAZIONI DI CASSA O CONTO CORRENTE"]
["ABBUONI SU PAGAMENTI DA EFFETTUARE"]
[null,null,null,null,"PER SPESE A DEBITO dell'ESERCIZIO (diminuisce direttamente la spesa oggetto di abbuono ed il relativo debito)"]
[null,null,null,null,"diminuzione della spesa dell'importo dell'abbuono",null,null,null,null,null,null,"S.cc.nv",-1]
[null,null,null,null,"Stringa Informativa Fine Debito",null,null,null,null,null,null,"D.02.nv.XX",-1]
[null,null,null,null,"N.B.  Le due scrittura di sopra possono essere evitate intervenendo direttamente sulle scritture della spesa e del debito precedentemente registrate, diminuendo la spesa ed il debito dell'abbuono.\nQuesto è possibile in quanto l'abbuono concerne una spesa ed un debito dell'esercizio in corso."]
[null,null,null,null,"PER SPESE A DEBITO DI ESERCIZI PRECEDENTI. (Pagamento del debito non contestuale alla registrazione dell'abbuono)\nL'abbuono è per la procedura una restituzione ai condomini cui era stata attribuita la spesa. L'abbuono diminuisce il debito del condominio per fatture ricevute e non ancora pagate."]
[null,null,null,null,"Abbuono su pagamento dovuto al creditore QQQQQQQ ",null,null,null,null,null,null,"A.01.nt",5]
[null,null,null,null,"Stringa Informativa Fine Debito",null,null,null,null,null,null,"D.02.nv.YY",-5]
[18,11,2,"YYYY","Il fornitore01 rinuncia al suo credito # 33.",null,null,56.23,null,null,423.11,"D.02.02.19",-80]
[18,11,2,"YYYY","Abbuono su pagamento da ripartire su tabella D (civico 82)",null,null,56.23,null,null,423.11,"A.01.04",40]
[18,11,2,"YYYY","Abbuono su pagamento da ripartire su tabella E (civico 84)",null,null,56.23,null,null,423.11,"A.01.05",40]
["REGISTRAZIONE a RICEZIONE DOCUMENTI CONTABILI (fattura, ricevuta, ecc.) "]
[null,null,null,null,"Descrizione libera dell'operazione. [esempio: Ricevuta fattura n° 125 del 10-10.2019 per acquisto prodotti di pulizia presso BricoK di Soverato)\nSe l'unico documento contabile contiene spese attribuibili a più voci, occorre inserire più righe,  ognuna delle quali contiene la descrizione della spesa, il codice del conto ed il relativo importo movimentato.\nOccorre controllare che la somma degli importi delle voci sia uguale all'importo del documento.",null,null,null,null,null,null,"S.kk.zz",110]
[null,null,null,null,"Stringa Informativa Origine Debito",null,null,null,null,null,null,"D.02.01.XX",110]
[22,7,3,"YYYY","Ricevuta Fattura  PULIZIE PERFETTE 7/2020 del 03-03-2020",null,null,125.12,null,null,324.17]
[22,7,3,"YYYY","v/s PULIZIE PERFETTE # fattura 7/20 del 3-3-2020 # 25 # C-06 # 03-03-2020",null,null,125.12,null,null,324.17,"D.02.01.20",95.16]
[22,7,3,"YYYY","Ripartizione: scala A - civico 71",null,null,125.12,null,null,324.17,"S.02.02",31.72]
[22,7,3,"YYYY","Ripartizione: scala B - civico 53",null,null,125.12,null,null,324.17,"S.02.03",31.72]
[22,7,3,"YYYY","Ripartizione: scala C - civico 45",null,null,125.12,null,null,324.17,"S.02.04",31.72]
["REGISTRAZIONE a RICEZIONE di Avvisi di DOCUMENTI CONTABILI (avvisi di fattura, ecc.) "]
[null,null,null,null,"Descrizione libera dell'operazione. [esempio: Ricevuta avviso fattura da parte di WWWWWWW QQQQQQ)\nSe l'unico documento contabile contiene spese attribuibili a più voci, occorre inserire più righe,  ognuna delle quali contiene la descrizione della spesa, il codice del conto ed il relativo importo movimentato.\nOccorre controllare che la somma degli importi delle voci sia uguale all'importo del documento.",null,null,null,null,null,null,"S.kk.zz",110]
[null,null,null,null,"Stringa Informativa Origine Debito",null,null,null,null,null,null,"D.02.02.XX",110]
[14,7,3,"YYYY","Ricevuto avviso di fattura rag. Pippo Pippo ",null,null,125.12,null,null,324.17,"S.01.07",120]
[14,7,3,"YYYY","v/s PIPPO PIPPO # avviso di fattura # 27 # C-11 # 03-04-2020",null,null,125.12,null,null,324.17,"D.02.02.20",120]
["REGISTRAZIONE per PREVISIONE DI SPESA da ACCORDI e CONTRATTI"]
[null,null,null,null,"Descrizione libera dell'operazione. [esempio: Compenso pattuito con WWWWWWW QQQQQQ per trasmissione modello 770 relativo alla esercizio in corso))\nSe l'unico documento contabile contiene spese attribuibili a più voci, occorre inserire più righe,  ognuna delle quali contiene la descrizione della spesa, il codice del conto ed il relativo importo movimentato.\nOccorre controllare che la somma degli importi delle voci sia uguale all'importo del documento.",null,null,null,null,null,null,"S.kk.zz",110]
[null,null,null,null,"Stringa Informativa Origine Debito",null,null,null,null,null,null,"D.02.03.XX",110]
[44,31,12,"YYYY","Parte del Compenso Amministratore per l'esercizio 2020 (non ancora corrisposto) ",null,null,125.12,null,null,324.17,"S.01.06",120]
[44,31,12,"YYYY","v/s Amministratore #  previsione certa di spesa # 31 # C-10 # 03-05-2020",null,null,125.12,null,null,324.17,"D.02.03.20",120]

{"sheet":"mf01","index":19,"n_rows":52,"n_cols":35,"rows_kept":52,"cut":false,"hidden":true,"merged":[[0,1,0,35]]}
[null,"Il modulo è utilizzato dalla procedura per creare documenti costituenti comunicazioni ai condomini su vari argomenti.\nPossono essere inserite altre righe ed in questo caso la stampa sarà su più facciate su più pagine."]
[]
[null,null,"[Incarico dell'Amministrazione]",null,null,null,null,null,null,null,null,null,null,null,null,null,null,null,null,null,null,null,null,null,null,null,null,null,null,null,null,null,null,null,"[Nome]"]
[null,null,"[Nome]",null,null,null,null,null,null,null,null,null,null,null,null,null,null,null,null,null,null,null,null,null,null,null,null,null,null,null,null,null,null,null,"[Indirizzo]"]
[null,null,"[Indirizzo amministratore]",null,null,null,null,null,null,null,null,null,null,null,null,null,null,null,null,null,null,null,null,null,null,null,null,null,null,null,null,null,null,null,"[e-mail condominio]"]
[null,null,"[cellulare amministratore]",null,null,null,null,null,null,null,null,null,null,null,null,null,null,null,null,null,null,null,null,null,null,null,null,null,null,null,null,null,null,null,"[numero c.c.p.]"]
[null,null,null,null,null,null,null,null,null,null,null,null,null,null,null,null,null,null,null,null,null,null,null,null,null,null,null,null,null,null,null,null,null,null,"[IBAN]"]
[null,null,null,null,null,null,null,null,null,null,null,null,null,null,null,null,null,null,null,null,null,null,null,null,null,null,null,null,null,null,null,null,null,null,"[C.F.]"]
[]
[]
[null,null,null,null,null,null,null,null,null,null,null,null,null,null,null,null,null,"[Titolo del Condomino]"]
[null,null,null,null,null,null,null,null,null,null,null,null,null,null,null,null,null,"[Condomino]"]
[null,null,null,null,null,null,null,null,null,null,null,null,null,null,null,null,null,"[Referente o IndirizzoVia]"]
[null,null,null,null,null,null,null,null,null,null,null,null,null,null,null,null,null,"[IndirizzoVia o IndirizzoCittà]"]
[null,null,null,null,null,null,null,null,null,null,null,null,null,null,null,null,null,"[vuoto o IndirizzoCittà]"]
[null,null,null,null,null,null,null,null,null,null,null,null,null,null,null,null,null,"[millesimi]"]
[]
[]
[null,null,null,"OGGETTO: "]
[]
[null,null,null,"Con la presente si informa la S.V. di quanto segue:"]
[]
[]
[]
[]
[]
[]
[]
[]
[]
[]
[]
[]
[]
[]
[]
[]
[]
[]
[]
[]
[]
[]
[]
[]
[]
[]
[]
[]
[]
[]
[null,null,null,"{Luogo e data}",null,null,null,null,null,null,null,null,null,null,null,null,null,null,null,null,null,null,null,null,null,"{L'Amministratore}"]

{"sheet":"mf02","index":20,"n_rows":59,"n_cols":35,"rows_kept":59,"cut":false,"hidden":true,"merged":[[47,22,47,27],[47,9,47,21],[32,9,32,13],[53,3,54,34],[25,30,25,34],[29,3,31,32],[27,30,27,34],[28,30,28,34],[32,14,32,21],[32,22,32,27],[17,3,18,34],[21,30,21,34],[24,30,24,34],[26,30,26,34],[22,3,23,25],[20,3,21,25]]}
[null,"È consentito variare i valori delle sole celle con sfondo bianco o con nessun riempimento."]
[]
[null,null,"[Incarico dell'Amministrazione]",null,null,null,null,null,null,null,null,null,null,null,null,null,null,null,null,null,null,null,null,null,null,null,null,null,null,null,null,null,null,null,"[Nome]"]
[null,null,"[Nome]",null,null,null,null,null,null,null,null,null,null,null,null,null,null,null,null,null,null,null,null,null,null,null,null,null,null,null,null,null,null,null,"[Indirizzo]"]
[null,null,"[Indirizzo amministratore]",null,null,null,null,null,null,null,null,null,null,null,null,null,null,null,null,null,null,null,null,null,null,null,null,null,null,null,null,null,null,null,"[e-mail condominio]"]
[null,null,"[cellulare amministratore]",null,null,null,null,null,null,null,null,null,null,null,null,null,null,null,null,null,null,null,null,null,null,null,null,null,null,null,null,null,null,null,"[numero c.c.p.]"]
[null,null,null,null,null,null,null,null,null,null,null,null,null,null,null,null,null,null,null,null,null,null,null,null,null,null,null,null,null,null,null,null,null,null,"[IBAN]"]
[null,null,null,null,null,null,null,null,null,null,null,null,null,null,null,null,null,null,null,null,null,null,null,null,null,null,null,null,null,null,null,null,null,null,"[C.F.]"]
[]
[]
[null,null,null,null,null,null,null,null,null,null,null,null,null,null,null,null,null,"[Titolo del Condomino]"]
[null,null,null,null,null,null,null,null,null,null,null,null,null,null,null,null,null,"[Condomino]"]
[null,null,null,null,null,null,null,null,null,null,null,null,null,null,null,null,null,"[Referente o IndirizzoVia]"]
[null,null,null,null,null,null,null,null,null,null,null,null,null,null,null,null,null,"[IndirizzoVia o IndirizzoCittà]"]
[null,null,null,null,null,null,null,null,null,null,null,null,null,null,null,null,null,"[vuoto o IndirizzoCittà]"]
[null,null,null,null,null,null,null,null,null,null,null,null,null,null,null,null,null,"[millesimi]"]
[]
[null,null,null,{"$f":"\"OGGETTO: SITUAZIONE CONTABILE e RATEIZZAZIONE DEI CONTRIBUTI CONDOMINIALI PER L'ESERCIZIO  \"&iDG!B97&\" (Gestione Ordinaria)\"","v":"OGGETTO: SITUAZIONE CONTABILE e RATEIZZAZIONE DEI CONTRIBUTI CONDOMINIALI PER L'ESERCIZIO  2024 (Gestione Ordinaria)"}]
[]
[]
[null,null,null,{"$f":"\"Dal prospetto di ripartizione delle spese preventivate per l'esercizio \" & iDG!B97 & \" risulta un contributo annuale da lei dovuto di\"","v":"Dal prospetto di ripartizione delle spese preventivate per l'esercizio 2024 risulta un contributo annuale da lei dovuto di"}]
[null,null,null,null,null,null,null,null,null,null,null,null,null,null,null,null,null,null,null,null,null,null,null,null,null,null,null,"euro"]
[null,null,null,{"$f":"\"Dal prospetto di ripartizione del rendiconto consuntivo relativo all' esercizio \" & (iDG!B97-1) & \" risulta un conguaglio\"","v":"Dal prospetto di ripartizione del rendiconto consuntivo relativo all' esercizio 2023 risulta un conguaglio"}]
[]
[null,null,null,null,null,null,null,null,null,null,null,null,null,null,null,null,null,null,null,null,null,null,null,null,"a suo debito",null,null,"euro"]
[null,null,null,null,null,null,null,null,null,null,null,null,null,null,null,null,null,null,null,null,null,null,null,null,"a suo credito",null,null,"euro"]
[null,null,null,{"$f":"\"Pertanto l'ammontare dovuto per l'esercizio \" &iDG!B97 & \" è pari a\"","v":"Pertanto l'ammontare dovuto per l'esercizio 2024 è pari a"},null,null,null,null,null,null,null,null,null,null,null,null,null,null,null,null,null,null,null,null,null,null,null,"euro"]
[null,null,null,"Risultano ancora delle quote arretrate non versate per  un importo di",null,null,null,null,null,null,null,null,null,null,null,null,null,null,null,null,null,null,null,null,null,null,null,"euro"]
[null,null,null,"Totale dovuto nell'esercizio ",null,null,null,null,null,null,null,null,null,null,null,null,null,null,null,null,null,null,null,null,null,null,null,"euro"]
[null,null,null,"Il versamento dell' importo può essere frazionato in rate con le scadenze riportate nel sottostante prospetto, che non tiene conto di eventuali suoi versamenti effettuati nel corrente anno."]
[]
[]
[null,null,null,null,null,null,null,null,null,"Versamento",null,null,null,null,"Scadenza",null,null,null,null,null,null,null,"Importo"]
[null,null,null,null,null,null,null,null,null,"Arretrati"]
[null,null,null,null,null,null,null,null,null,"Conguaglio"]
[null,null,null,null,null,null,null,null,null,"Rata 1a"]
[null,null,null,null,null,null,null,null,null,"Rata 2a"]
[null,null,null,null,null,null,null,null,null,"Rata 3a"]
[null,null,null,null,null,null,null,null,null,"Rata 4a"]
[null,null,null,null,null,null,null,null,null,"Rata 5a"]
[null,null,null,null,null,null,null,null,null,"Rata 6a"]
[null,null,null,null,null,null,null,null,null,"Rata 7a"]
[null,null,null,null,null,null,null,null,null,"Rata 8a"]
[null,null,null,null,null,null,null,null,null,"Rata 9a"]
[null,null,null,null,null,null,null,null,null,"Rata 10a"]
[null,null,null,null,null,null,null,null,null,"Rata 11a"]
[null,null,null,null,null,null,null,null,null,"Rata 12a"]
[null,null,null,null,null,null,null,null,null,"Totale euro",null,null,null,null,null,null,null,null,null,null,null,null,{"$f":"SUM(W34:AB47)","v":0}]
[]
[null,null,null,"I pagamenti possono essere eseguiti secondo una delle seguenti modalità :"]
[null,null,null,"·","[direttamente all’Amministratore in contanti o Assegno Bancario intestato a ]"]
[null,null,null,"·","[tramite Bonifico  intestato a ]"]
[null,null,null,"·","[tramite versamento su c.c.p. ]"]
[null,null,null,"È gradito in ogni caso l'anticipo, in tutto o in parte, del versamento delle rate, al fine di agevolare e ottimizzare la gestione del Condominio."]
[]
[]
[null,null,null,"Distinti saluti."]
[]
[null,null,null,"{Luogo e data}",null,null,null,null,null,null,null,null,null,null,null,null,null,null,null,null,null,null,null,null,"{Amministratore}"]

{"sheet":"mf03","index":21,"n_rows":71,"n_cols":35,"rows_kept":71,"cut":false,"hidden":true,"merged":[[62,23,62,32],[63,23,63,32],[49,3,49,12],[49,13,49,22],[49,23,49,32],[50,3,50,12],[50,13,50,22],[50,23,50,32],[51,3,51,12],[51,13,51,22],[51,23,51,32],[52,3,52,12],[52,13,52,22],[52,23,52,32],[53,3,53,12],[53,13,53,22],[56,23,56,32],[59,23,59,32],[61,13,61,22],[56,3,56,12],[59,3,59,12],[59,13,59,22],[56,13,56,22],[60,23,60,32],[61,23,61,32],[48,3,48,12],[48,23,48,32],[55,3,55,12],[48,13,48,22],[55,13,55,22],[55,23,55,32],[53,23,53,32],[54,3,54,12],[54,13,54,22],[54,23,54,32],[62,3,62,12],[63,3,63,12],[62,13,62,22],[63,13,63,22],[60,3,60,12],[61,3,61,12],[60,13,60,22],[64,3,64,22],[67,3,67,33],[65,3,65,22],[64,23,64,32],[65,23,65,32],[39,3,39,27],[39,29,39,33],[41,3,41,33],[47,3,47,12],[47,13,47,22],[47,23,47,32],[45,3,45,34],[36,3,36,28],[36,29,36,33],[37,3,37,28],[37,29,37,33],[38,3,38,28],[38,29,38,33],[19,3,19,33],[57,3,57,12],[57,13,57,22],[57,23,57,32],[58,3,58,12],[58,13,58,22],[58,23,58,32],[23,26,23,33],[24,26,24,33],[30,5,30,33],[33,3,33,28],[33,29,33,33],[34,3,34,28],[34,29,34,33],[35,3,35,28],[35,29,35,33]]}
[null,"È consentito variare i valori delle sole celle con sfondo bianco o con nessun riempimento."]
[]
[null,null,"[Incarico dell'Amministrazione]",null,null,null,null,null,null,null,null,null,null,null,null,null,null,null,null,null,null,null,null,null,null,null,null,null,null,null,null,null,null,null,"[Nome]"]
[null,null,"[Nome]",null,null,null,null,null,null,null,null,null,null,null,null,null,null,null,null,null,null,null,null,null,null,null,null,null,null,null,null,null,null,null,"[Indirizzo]"]
[null,null,"[Indirizzo amministratore]",null,null,null,null,null,null,null,null,null,null,null,null,null,null,null,null,null,null,null,null,null,null,null,null,null,null,null,null,null,null,null,"[e-mail condominio]"]
[null,null,"[cellulare amministratore]",null,null,null,null,null,null,null,null,null,null,null,null,null,null,null,null,null,null,null,null,null,null,null,null,null,null,null,null,null,null,null,"[numero c.c.p.]"]
[null,null,null,null,null,null,null,null,null,null,null,null,null,null,null,null,null,null,null,null,null,null,null,null,null,null,null,null,null,null,null,null,null,null,"[IBAN]"]
[null,null,null,null,null,null,null,null,null,null,null,null,null,null,null,null,null,null,null,null,null,null,null,null,null,null,null,null,null,null,null,null,null,null,"[C.F.]"]
[]
[]
[null,null,null,null,null,null,null,null,null,null,null,null,null,null,null,null,null,"[Titolo del Condomino]"]
[null,null,null,null,null,null,null,null,null,null,null,null,null,null,null,null,null,"[Condomino]"]
[null,null,null,null,null,null,null,null,null,null,null,null,null,null,null,null,null,"[Referente o IndirizzoVia]"]
[null,null,null,null,null,null,null,null,null,null,null,null,null,null,null,null,null,"[IndirizzoVia o IndirizzoCittà]"]
[null,null,null,null,null,null,null,null,null,null,null,null,null,null,null,null,null,"[vuoto o IndirizzoCittà]"]
[null,null,null,null,null,null,null,null,null,null,null,null,null,null,null,null,null,"[millesimi]"]
[]
[null,null,null,"OGGETTO:  RICEVUTA DI PAGAMENTO CONTRIBUTI CONDOMINIALI"]
[]
[null,null,null,"La presente comunicazione costituisce ricevuta del pagamento da Lei effettuato degli oneri condominiali riportati."]
[]
[]
[null,null,null,{"$f":"AI3","v":"[Nome]"},null,null,null,null,null,null,null,null,null,null,null,null,null,null,null,null,null,null,null,null,"RICEVUTA"]
[null,null,null,{"$f":"AI4","v":"[Indirizzo]"},null,null,null,null,null,null,null,null,null,null,null,null,null,null,null,null,null,null,null,null,"n."]
[null,null,null,null,null,null,null,null,null,null,null,null,null,null,null,null,null,null,null,null,null,null,null,null,"Data "]
[]
[]
[null,null,null,"Ricevuta dal Condomino",null,null,null,null,null,null,null,null,{"$f":"R12","v":"[Condomino]"}]
[null,null,null,"la somma di "]
[]
[null,null,null,"€"]
[]
[null,null,null,"per"]
[]
[]
[]
[]
[]
[]
[null,null,null,"TOTALE SOMMA RICEVUTA",null,null,null,null,null,null,null,null,null,null,null,null,null,null,null,null,null,null,null,null,null,null,null,null,null,{"$f":"SUM(AD34:AH39)","v":0}]
[]
[null,null,null,"La presente ricevuta viene rilasciata s.b.f. degli assegni e con riserva di esigere ogni altra somma che risultasse dovuta in seguito a rendiconto consuntivo, nuovi accertamenti o nuove delibere dell'Assemblea."]
[]
[null,null,null,"La presente sostituisce ogni altra ricevuta provvisoria relativa allo stesso pagamento."]
[]
[null,null,null,"Quale utile promemoria si riporta un prospetto degli oneri condominiali ancora da versare nell'esercizio in corso:"]
[]
[null,null,null,"CAUSALE",null,null,null,null,null,null,null,null,null,"Scadenza",null,null,null,null,null,null,null,null,null,"Importo ancora dovuto"]
[]
[]
[]
[]
[]
[]
[]
[]
[]
[]
[]
[]
[]
[]
[]
[]
[null,null,null,"Totale a suo debito  ",null,null,null,null,null,null,null,null,null,null,null,null,null,null,null,null,null,null,null,{"$f":"SUM(X49:X64)","v":0}]
[null,null,null,"Totale a suo credito "]
[]
[]
[]
[]
[null,null,null,"{Luogo e data}",null,null,null,null,null,null,null,null,null,null,null,null,null,null,null,null,null,null,null,null,"{Amministratore}"]

{"sheet":"mf04","index":22,"n_rows":60,"n_cols":35,"rows_kept":60,"cut":false,"hidden":true,"merged":[[43,11,43,26],[44,11,44,26],[51,3,52,33],[37,9,37,19],[37,20,37,25],[37,26,37,30],[38,26,38,30],[40,3,41,33],[33,20,33,25],[33,26,33,30],[36,9,36,19],[36,20,36,25],[36,26,36,30],[34,9,34,19],[34,20,34,25],[35,9,35,19],[35,20,35,25],[35,26,35,30],[34,26,34,30],[29,9,29,19],[29,20,29,25],[29,26,29,30],[27,26,27,30],[28,20,28,25],[28,26,28,30],[23,9,23,19],[23,20,23,25],[23,26,23,30],[17,2,17,35],[19,3,21,33],[25,20,25,25],[25,26,25,30],[24,26,24,30],[25,9,25,19],[24,9,24,19],[24,20,24,25],[26,9,26,19],[26,26,26,30],[26,20,26,25],[33,9,33,19],[28,9,28,19],[30,9,30,19],[32,9,32,19],[32,26,32,30],[30,20,30,25],[30,26,30,30],[31,20,31,25],[31,26,31,30],[31,9,31,19],[32,20,32,25],[27,9,27,19],[27,20,27,25]]}
[null,"È consentito variare i valori delle sole celle con sfondo bianco o con nessun riempimento."]
[]
[null,null,"[Incarico dell'Amministrazione]",null,null,null,null,null,null,null,null,null,null,null,null,null,null,null,null,null,null,null,null,null,null,null,null,null,null,null,null,null,null,null,"[Nome]"]
[null,null,"[Nome]",null,null,null,null,null,null,null,null,null,null,null,null,null,null,null,null,null,null,null,null,null,null,null,null,null,null,null,null,null,null,null,"[Indirizzo]"]
[null,null,"[Indirizzo amministratore]",null,null,null,null,null,null,null,null,null,null,null,null,null,null,null,null,null,null,null,null,null,null,null,null,null,null,null,null,null,null,null,"[e-mail condominio]"]
[null,null,"[cellulare amministratore]",null,null,null,null,null,null,null,null,null,null,null,null,null,null,null,null,null,null,null,null,null,null,null,null,null,null,null,null,null,null,null,"[numero c.c.p.]"]
[null,null,null,null,null,null,null,null,null,null,null,null,null,null,null,null,null,null,null,null,null,null,null,null,null,null,null,null,null,null,null,null,null,null,"[IBAN]"]
[null,null,null,null,null,null,null,null,null,null,null,null,null,null,null,null,null,null,null,null,null,null,null,null,null,null,null,null,null,null,null,null,null,null,"[C.F.]"]
[]
[]
[null,null,null,null,null,null,null,null,null,null,null,null,null,null,null,null,null,"[Titolo del Condomino]"]
[null,null,null,null,null,null,null,null,null,null,null,null,null,null,null,null,null,"[Condomino]"]
[null,null,null,null,null,null,null,null,null,null,null,null,null,null,null,null,null,"[Referente o IndirizzoVia]"]
[null,null,null,null,null,null,null,null,null,null,null,null,null,null,null,null,null,"[IndirizzoVia o IndirizzoCittà]"]
[null,null,null,null,null,null,null,null,null,null,null,null,null,null,null,null,null,"[vuoto o IndirizzoCittà]"]
[null,null,null,null,null,null,null,null,null,null,null,null,null,null,null,null,null,"[millesimi]"]
[]
[null,null,"OGGETTO: SOLLECITO DI PAGAMENTO CONTRIBUTI GESTIONE ORDINARIA"]
[]
[null,null,null,"Alla data della presente, dalle risultanze dei libri contabili, si rileva una sua situazione debitoria nei confronti del condominio per contributi da lei dovuti e non ancora pagati, secondo quanto riassunto nel seguente prospetto:"]
[]
[]
[]
[null,null,null,null,null,null,null,null,null,"Causale",null,null,null,null,null,null,null,null,null,null,"Scadenza",null,null,null,null,null,"Importo"]
[]
[]
[]
[]
[]
[]
[]
[]
[]
[]
[]
[]
[]
[]
[null,null,null,null,null,null,null,null,null,null,null,null,null,null,null,null,null,null,null,null,null,null,null,null,null,"Totale euro",{"$f":"SUM(AA25:AE38)","v":0}]
[]
[null,null,null,"Dell'importo di cui sopra è da considerare in mora, in quanto sono trascorsi più di 90 giorni dalla data di scadenza dei relativi pagamenti, l'importo seguente"]
[]
[]
[null,null,null,null,null,null,null,null,null,null,null,"Importo debito in mora:"]
[]
[]
[null,null,null,"I pagamenti possono essere eseguiti secondo una delle seguenti modalità :"]
[null,null,null,"·","[direttamente all’Amministratore in contanti o Assegno Bancario intestato a ]"]
[null,null,null,"·","[tramite Bonifico  intestato a ]"]
[null,null,null,"·","[tramite versamento su c.c.p. ]"]
[]
[null,null,null,"Nel protrarsi della Sua inadempienza, mi vedrò costretto a richiedere quanto dovuto mediante diffida con raccomadata R.R. e conseguente aggravio di spese a Suo carico."]
[]
[]
[null,null,null,"Se nel frattempo Lei avesse già effettuato i pagamenti, non tenga conto della presente."]
[]
[null,null,null,"In attesa di un pronto riscontro, porgo distinti saluti."]
[]
[]
[null,null,null,"{Luogo e data}",null,null,null,null,null,null,null,null,null,null,null,null,null,null,null,null,null,null,null,null,"{Amministratore}"]

{"sheet":"mf05","index":23,"n_rows":56,"n_cols":35,"rows_kept":56,"cut":false,"hidden":true,"merged":[[24,26,24,31],[11,39,11,42],[12,39,12,42],[13,39,13,42],[19,3,20,34],[22,6,22,25],[22,26,22,31],[31,6,31,25],[31,26,31,31],[25,6,25,25],[25,26,25,31],[26,6,26,25],[26,26,26,31],[27,6,27,25],[27,26,27,31],[29,6,29,25],[29,26,29,31],[39,3,40,34],[41,3,42,34],[28,26,28,31],[23,6,23,25],[23,26,23,31],[33,26,33,31],[36,3,38,34],[32,6,32,25],[32,26,32,31],[24,6,24,25],[34,26,34,31],[34,6,34,25],[30,6,30,25],[28,6,28,25],[33,6,33,25],[30,26,30,31]]}
[null,"È consentito variare i valori delle sole celle con sfondo bianco o con nessun riempimento."]
[]
[null,null,"[Incarico dell'Amministrazione]",null,null,null,null,null,null,null,null,null,null,null,null,null,null,null,null,null,null,null,null,null,null,null,null,null,null,null,null,null,null,null,"[Nome]"]
[null,null,"[Nome]",null,null,null,null,null,null,null,null,null,null,null,null,null,null,null,null,null,null,null,null,null,null,null,null,null,null,null,null,null,null,null,"[Indirizzo]"]
[null,null,"[Indirizzo amministratore]",null,null,null,null,null,null,null,null,null,null,null,null,null,null,null,null,null,null,null,null,null,null,null,null,null,null,null,null,null,null,null,"[e-mail condominio]"]
[null,null,"[cellulare amministratore]",null,null,null,null,null,null,null,null,null,null,null,null,null,null,null,null,null,null,null,null,null,null,null,null,null,null,null,null,null,null,null,"[numero c.c.p.]"]
[null,null,null,null,null,null,null,null,null,null,null,null,null,null,null,null,null,null,null,null,null,null,null,null,null,null,null,null,null,null,null,null,null,null,"[IBAN]"]
[null,null,null,null,null,null,null,null,null,null,null,null,null,null,null,null,null,null,null,null,null,null,null,null,null,null,null,null,null,null,null,null,null,null,"[C.F.]"]
[]
[]
[null,null,null,null,null,null,null,null,null,null,null,null,null,null,null,null,null,"[Titolo del Condomino]"]
[null,null,null,null,null,null,null,null,null,null,null,null,null,null,null,null,null,"[Condomino]"]
[null,null,null,null,null,null,null,null,null,null,null,null,null,null,null,null,null,"[Referente o IndirizzoVia]"]
[null,null,null,null,null,null,null,null,null,null,null,null,null,null,null,null,null,"[IndirizzoVia o IndirizzoCittà]"]
[null,null,null,null,null,null,null,null,null,null,null,null,null,null,null,null,null,"[vuoto o IndirizzoCittà]"]
[null,null,null,null,null,null,null,null,null,null,null,null,null,null,null,null,null,"[millesimi]"]
[]
[null,null,null,"OGGETTO: DIFFIDA PER MANCATO VERSAMENTO CONTRIBUTI CONDOMINIALI"]
[]
[null,null,null,"Premessa la seguente Sua situazione per i contributi condominiali scaduti alla data della presente e non ancora pagati"]
[]
[]
[null,null,null,null,null,null,"Causale contributo non versato",null,null,null,null,null,null,null,null,null,null,null,null,null,null,null,null,null,null,null,"Importo"]
[]
[]
[]
[]
[]
[]
[]
[]
[]
[]
[]
[null,null,null,null,null,null,"TOTALE",null,null,null,null,null,null,null,null,null,null,null,null,null,null,null,null,null,null,null,{"$f":"SUM(AA24:AF34)","v":0}]
[]
[null,null,null,"Con la presente Le sollecito il pagamento dei contributi condominiali di cui sopra, entro il termine perentorio di giorni 15 (quindici) dal ricevimento della presente raccomandata. Ove per data di ricevimento è da intendersi quella comunicata da POSTE ITALIANE come data di consegna o di rilascio dell'avviso di giacenza."]
[]
[]
[null,null,null,"Le preannuncio che in difetto di quanto sopra, sarò costretto, mio malgrado, senza ulteriori avvisi, al recupero coatto delle somme dovute, con aggravio a suo carico delle maggior spese."]
[]
[null,null,null,"La presente vale quale diffida e formale messa in mora, ai sensi e per gli effetti dell'art. 1219 C.C. e ad ogni effetto di legge e, come tale, interruttiva di ogni termine prescrizionale."]
[]
[]
[null,null,null,"I pagamenti possono essere eseguiti secondo una delle seguenti modalità :"]
[null,null,null,"·","[direttamente all’Amministratore in contanti o Assegno Bancario intestato a ]"]
[null,null,null,"·","[tramite Bonifico  intestato a ]"]
[null,null,null,"·","[tramite versamento su c.c.p. ]"]
[]
[null,null,null,"Se nel frattempo Lei avesse già effettuato il pagamento, non tenga conto della presente."]
[]
[null,null,null,"In attesa di un pronto riscontro, porgo distinti saluti."]
[]
[]
[]
[null,null,null,"{Luogo e data}",null,null,null,null,null,null,null,null,null,null,null,null,null,null,null,null,null,null,null,null,"{Amministratore}"]

{"sheet":"mf06","index":24,"n_rows":41,"n_cols":35,"rows_kept":41,"cut":false,"hidden":true,"merged":[[33,3,33,34],[35,3,35,34],[37,3,37,34],[26,5,26,34],[27,5,27,34],[28,5,28,34],[29,5,29,34],[30,5,30,35],[32,3,32,34],[25,5,25,34],[17,2,17,34],[19,3,19,34],[21,3,21,35],[23,5,23,34],[24,5,24,34]]}
[]
[]
[null,null,"[Incarico dell'Amministrazione]",null,null,null,null,null,null,null,null,null,null,null,null,null,null,null,null,null,null,null,null,null,null,null,null,null,null,null,null,null,null,null,"[Nome]"]
[null,null,"[Nome]",null,null,null,null,null,null,null,null,null,null,null,null,null,null,null,null,null,null,null,null,null,null,null,null,null,null,null,null,null,null,null,"[Indirizzo]"]
[null,null,"[Indirizzo amministratore]",null,null,null,null,null,null,null,null,null,null,null,null,null,null,null,null,null,null,null,null,null,null,null,null,null,null,null,null,null,null,null,"[e-mail condominio]"]
[null,null,"[cellulare amministratore]",null,null,null,null,null,null,null,null,null,null,null,null,null,null,null,null,null,null,null,null,null,null,null,null,null,null,null,null,null,null,null,"[numero c.c.p.]"]
[null,null,null,null,null,null,null,null,null,null,null,null,null,null,null,null,null,null,null,null,null,null,null,null,null,null,null,null,null,null,null,null,null,null,"[IBAN]"]
[null,null,null,null,null,null,null,null,null,null,null,null,null,null,null,null,null,null,null,null,null,null,null,null,null,null,null,null,null,null,null,null,null,null,"[C.F.]"]
[]
[]
[null,null,null,null,null,null,null,null,null,null,null,null,null,null,null,null,null,"[Titolo del Condomino]"]
[null,null,null,null,null,null,null,null,null,null,null,null,null,null,null,null,null,"[Condomino]"]
[null,null,null,null,null,null,null,null,null,null,null,null,null,null,null,null,null,"[Referente o IndirizzoVia]"]
[null,null,null,null,null,null,null,null,null,null,null,null,null,null,null,null,null,"[IndirizzoVia o IndirizzoCittà]"]
[null,null,null,null,null,null,null,null,null,null,null,null,null,null,null,null,null,"[vuoto o IndirizzoCittà]"]
[null,null,null,null,null,null,null,null,null,null,null,null,null,null,null,null,null,"[millesimi]"]
[]
[null,null,"CONVOCAZIONE ASSEMBLEA ORDINARIA"]
[]
[null,null,null,"La S.V. è invitata all'Assemblea Straordinaria che si terrà in prima convocazione il giorno giovedì 30-giugno-XXXX4 alle ore 8,30 presso i locali del Condominio a piano terra ed eventualmente, nel caso non si raggiunga il numero legale, in seconda convocazione, il giorno seguente venerdì 1-luglio XXXX alle ore 17,00, sempre nello stesso luogo per discutere e deliberare sui punti del seguente:"]
[]
[null,null,null,"ORDINE DEL GIORNO"]
[]
[null,null,null,1,null,"APPROVAZIONE PROGETTO RISANAMENTO FACCIATE CON RELATIVO PREVENTIVO DI SPESA."]
[null,null,null,2,null,"APPROVAZIONE RESOCONTO DI GESTIONE AL 31-12-YYYY E RIPARTO DELLE SPESE FRA I CONDOMINI"]
[null,null,null,3,null,"APPROVAZIONE RIPARTO FRA I CONDOMINI DEL PREVENTIVO DI SPESA e RATEAZIONE DELLE QUOTE"]
[null,null,null,4,null,"ESAME DELLE OFFERTE E SCALTA DELL'IMPRESA ESECUTRICE DEI LAVORI"]
[null,null,null,5,null,"NOMINA o CONFERMA AMMINISTRATORE"]
[null,null,null,6,null,"DISCUSSIONE SU LAVORI SISMABONUS e ECOBONUS, APPROVAZIONE DELLE CONDIZIONI PER PROSEGUIRE L'ITER REALIZZATIVO DI TALI LAVORI"]
[null,null,null,7]
[null,null,null,7,null,"VARIE ED EVENTUALI"]
[]
[null,null,null,"Si ricorda che a causa della pandemia, durante l'assemblea in presenza, occorre rispettare le disposizioni in materia di distanziamento sociale e uso dei dispositivi di protezione individuale.\n"]
[null,null,null,"Vista l'importanza, è auspicabile che la S.V. sia personalmente presente in assemblea, ma in caso di impedimento può delegare un'altra persona a rappresentarla; si allega quindi un modello di delega."]
[]
[null,null,null,"Si allegano i documenti da approvare e si rammenta che per quanto concerne i punti 2-3 e 4 dell'OdG basta il quorum di un terzo per la validità costitutiva in seconda convocazione, mentre per il punto 5 occorre il quorum di 500/1000 per la nomina o di 1/3 per la conferma. "]
[]
[null,null,null,"L’amministratore dichiara la propria disponibilità a fornire tutti i chiarimenti sui documenti allegati all'o.d.g. su appuntamento telefonico, di mattina e in orario studio e ad esibire i documenti giustificativi delle spese."]
[]
[]
[null,null,null,"{Luogo e data}",null,null,null,null,null,null,null,null,null,null,null,null,null,null,null,null,null,null,null,null,"{Amministratore}"]

{"sheet":"mf07","index":25,"n_rows":49,"n_cols":35,"rows_kept":49,"cut":false,"hidden":true,"merged":[[42,2,42,9],[42,10,42,35],[44,10,44,35],[46,2,46,35],[25,2,25,35],[26,2,26,35],[28,2,28,35],[38,2,38,35],[39,2,39,35],[40,2,40,35],[24,2,24,35],[10,2,10,35],[12,2,12,34],[14,2,14,35],[16,4,16,34],[17,4,17,34],[18,4,18,34],[19,4,19,34],[20,4,20,34],[21,4,21,34],[22,4,22,34],[23,4,23,35]]}
[null,"È consentito variare i valori delle sole celle con sfondo bianco o con nessun riempimento."]
[null,null,"[Incarico dell'Amministrazione]",null,null,null,null,null,null,null,null,null,null,null,null,null,null,null,null,null,null,null,null,null,null,null,null,null,null,null,null,null,null,null,"[Nome]"]
[null,null,"[Nome]",null,null,null,null,null,null,null,null,null,null,null,null,null,null,null,null,null,null,null,null,null,null,null,null,null,null,null,null,null,null,null,"[Indirizzo]"]
[null,null,"[Indirizzo amministratore]",null,null,null,null,null,null,null,null,null,null,null,null,null,null,null,null,null,null,null,null,null,null,null,null,null,null,null,null,null,null,null,"[e-mail condominio]"]
[null,null,"[cellulare amministratore]",null,null,null,null,null,null,null,null,null,null,null,null,null,null,null,null,null,null,null,null,null,null,null,null,null,null,null,null,null,null,null,"[numero c.c.p.]"]
[null,null,null,null,null,null,null,null,null,null,null,null,null,null,null,null,null,null,null,null,null,null,null,null,null,null,null,null,null,null,null,null,null,null,"[IBAN]"]
[null,null,null,null,null,null,null,null,null,null,null,null,null,null,null,null,null,null,null,null,null,null,null,null,null,null,null,null,null,null,null,null,null,null,"[C.F.]"]
[]
[]
[]
[null,null,"CONVOCAZIONE ASSEMBLEA ORDINARIA"]
[]
[null,null,"La S.V. è invitata all'Assemblea Ordinaria che si terrà in prima convocazione il giorno mercoledì 12-giugno-2024 alle ore 20,00 presso i locali condominiali al piano terra e, eventualmente, nel caso non si raggiunga il numero legale, in seconda convocazione, il giorno seguente giovedì 13-giugno-2024 alle ore 16,30,  presso lo stesso luogo per discutere e deliberare sui punti del seguente:"]
[]
[null,null,"ORDINE DEL GIORNO"]
[]
[null,null,1,null,"RELAZIONE E COMUNICAZIONI VARIE DA PARTE DELL'AMMINISTRATORE"]
[null,null,2,null,"APPROVAZIONE RESOCONTO DELLA GESTIONE ORDINARIA AL 31-12-2023 E RIPARTO DELLE SPESE FRA I CONDOMINI"]
[null,null,3,null,"APPROVAZIONE BILANCIO PREVENTIVO DELLA GESTIONE ORDINARIA PER L'ESERCIZIO 2024 E RIPARTO DELLE SPESE FRA I CONDOMINI "]
[null,null,4,null,"NOMINA o CONFERMA AMMINISTRATORE, CON APPROVAZIONE DEL RELATIVO COMPENSO"]
[null,null,5,null,"APPROVAZIONE RENDICONTO LAVORI SULLE FACCIATE APPROVATI ED ESEGUITI CON IL FONDO ISTITUITO NELL' ASSEMBLEA DEL 28/06/2023."]
[null,null,6,null,"CONFERIMENTO INCARICO RECUPERO CREDITI CONDOMINIALI, SIA ORDINARI CHE STRAORDINARI, ALL'AVV. PIPPO PIPPO DEL FORO DI CATANZARO, CON STUDIO IN PAPEROPOLI  VIA BASETTONI, 160."]
[null,null,7,null,"VARIE ED EVENTUALI"]
[]
[null,null,"Vista l'importanza degli argomenti all'OdG, è auspicabile che la S.V. sia personalmente presente in assemblea, ma in caso di impossibilità personale può delegare un'altra persona a rappresentarla. Per farlo, può utilizzare completandola  e firmandola la delega sotto riportata."]
[null,null,"Si rammenta che per quanto concerne i punti 2, 3 e 6 dell'OdG il quorum di approvazione è a maggioranza dei presenti e di 1/3 dei millesimi, mentre per il punto 5  è richiesta l'approvazione sempre con la maggioranza dei presenti che rappresentino almeno 1/2 del valore dell'edificio. "]
[null,null,"Si allega copia dei documenti da approvare e precisamente: \nPunto 2 - Giornale di contabilità 2023 - Rendiconto con riparti - Nota sintetica sul rendiconto 2023.\nPunto 3 - Bilancio preventivo con riparti delle spese previste\nPunto 5 - Giornale di contabilità del fondo lavori FACCIATE - Rendiconto contabile con riparti."]
[]
[null,null,"Si dichiara la propria disponibilità a fornire tutti i chiarimenti su quanto allegato e ad esibire ogni altra documentazione giustificativa delle spese riportate, anche di persona  con appuntamento telefonico. "]
[]
[]
[null,null,null,"{Luogo e data}",null,null,null,null,null,null,null,null,null,null,null,null,null,null,null,null,null,null,null,null,"{Amministratore}"]
[]
[]
[]
[]
[]
[]
[null,null,"DELEGA"]
[null,null,"Condominio CUTURELLA D"]
[null,null,"----------------------------------------------------------------------------------------------------"]
[]
[null,null,"Il/La sottoscritto/a ",null,null,null,null,null,null,null,"_______________________________________________________________________"]
[]
[null,null,"delega il sig./ la sig.ra ",null,null,null,null,null,null,null,"_______________________________________________________________________"]
[]
[null,null,"a rappresentarlo/la nell'Assemblea dei Condomini del 12 e 13 giugno 2024 ed a votare gli argomenti posti all'ordine del giorno, con promessa, sin d'ora, di approvarne ogni decisione assunta dal/la delegato/a."]
[]
[null,null,"_____________________, lì ______________________",null,null,null,null,null,null,null,null,null,null,null,null,null,null,null,null,null,null,null,null,null,null,null,"In fede"]

{"sheet":"mf08","index":26,"n_rows":44,"n_cols":35,"rows_kept":44,"cut":false,"hidden":true,"merged":[[32,24,32,31],[36,13,36,14],[39,13,39,14],[43,3,43,15],[18,7,19,34],[21,3,21,34],[22,3,22,34],[23,3,23,34],[24,3,24,34],[31,24,31,31]]}
[]
[]
[null,null,"[Incarico dell'Amministrazione]",null,null,null,null,null,null,null,null,null,null,null,null,null,null,null,null,null,null,null,null,null,null,null,null,null,null,null,null,null,null,null,"[Nome]"]
[null,null,"[Nome]",null,null,null,null,null,null,null,null,null,null,null,null,null,null,null,null,null,null,null,null,null,null,null,null,null,null,null,null,null,null,null,"[Indirizzo]"]
[null,null,"[Indirizzo amministratore]",null,null,null,null,null,null,null,null,null,null,null,null,null,null,null,null,null,null,null,null,null,null,null,null,null,null,null,null,null,null,null,"[e-mail condominio]"]
[null,null,"[cellulare amministratore]",null,null,null,null,null,null,null,null,null,null,null,null,null,null,null,null,null,null,null,null,null,null,null,null,null,null,null,null,null,null,null,"[numero c.c.p.]"]
[null,null,null,null,null,null,null,null,null,null,null,null,null,null,null,null,null,null,null,null,null,null,null,null,null,null,null,null,null,null,null,null,null,null,"[IBAN]"]
[null,null,null,null,null,null,null,null,null,null,null,null,null,null,null,null,null,null,null,null,null,null,null,null,null,null,null,null,null,null,null,null,null,null,"[C.F.]"]
[]
[]
[null,null,null,null,null,null,null,null,null,null,null,null,null,null,null,null,null,"[Titolo del Condomino]"]
[null,null,null,null,null,null,null,null,null,null,null,null,null,null,null,null,null,"[Condomino]"]
[null,null,null,null,null,null,null,null,null,null,null,null,null,null,null,null,null,"[Referente o IndirizzoVia]"]
[null,null,null,null,null,null,null,null,null,null,null,null,null,null,null,null,null,"[IndirizzoVia o IndirizzoCittà]"]
[null,null,null,null,null,null,null,null,null,null,null,null,null,null,null,null,null,"[vuoto o IndirizzoCittà]"]
[]
[]
[]
[null,null,null,"OGGETTO: ",null,null,null,{"$f":"\"Certificazione redditi diversi derivanti dalla gestione condominiale ai fini dell'imposizione fiscale per l'anno \" & (iDG!B97-1)","v":"Certificazione redditi diversi derivanti dalla gestione condominiale ai fini dell'imposizione fiscale per l'anno 2023"}]
[]
[]
[]
[null,null,null,"nella sua qualità di amministratore dello stabile sito in "]
[]
[null,null,null,"ATTESTA"]
[]
[null,null,null,{"$f":"\"di aver conseguito proventi per conto del condominio sopracitato nel corso dell' anno \" & (iDG!B97-1)","v":"di aver conseguito proventi per conto del condominio sopracitato nel corso dell' anno 2023"}]
[null,null,null,{"$f":" \" per l'unità immobiliare di proprietà comune\"","v":" per l'unità immobiliare di proprietà comune"}]
[null,null,null,"per un importo totale di ",null,null,null,null,null,null,null,null,null,null,null,null,null,null,null,null,null,null,null,"euro"]
[null,null,null,{"$f":"\"I proventi sono quelli rilevati secondo il principio di cassa tra l' 01/01/\" & (iDG!B97-1) & \" e il 31/12/\" &(iDG!B97-1)","v":"I proventi sono quelli rilevati secondo il principio di cassa tra l' 01/01/2023 e il 31/12/2023"}]
[null,null,null,"Il riparto di tali proventi fra i condomini è fatto secondo la tabella A (della proprietà)"]
[null,null,null,"Millesimi del condomino in epigrafe"]
[null,null,null,"Importo di reddito proquota attribuito al condomino",null,null,null,null,null,null,null,null,null,null,null,null,null,null,null,null,null,null,null,"euro"]
[]
[null,null,null,"I dati catastali dell'unità immobiliare di proprietà condominiale sono"]
[null,null,null,"Comune"]
[null,null,null,"Foglio",null,null,null,null,null,"Particella",null,null,null,null,null,"Sub"]
[null,null,null,"Indirizzo"]
[null,null,null,"Piano"]
[null,null,null,"Zona",null,null,null,null,null,"Categoria     ",null,null,null,null,null,"Classe ",null,null,null,null,"Consistenza"]
[null,null,null,"Rendita "]
[]
[]
[null,null,null,"{Luogo e data}",null,null,null,null,null,null,null,null,null,null,null,null,null,null,null,null,null,null,null,"{Amministratore}"]

{"sheet":"mr01","index":27,"n_rows":41,"n_cols":35,"rows_kept":41,"cut":false,"hidden":true,"merged":[[22,3,23,34],[32,3,33,34],[0,1,0,35],[18,3,18,35],[20,11,20,34]]}
[null,"Il modulo è utilizzato dalla procedura per creare la ricevuta di avvenuta consegna a mano della convocazione dell'assemblea condominiale.\nOccorre variare il testo in blu che individua l'assemblea.\nLe ricevute sono ad uso dell'amministratore."]
[]
[null,null,"[Incarico dell'Amministrazione]",null,null,null,null,null,null,null,null,null,null,null,null,null,null,null,null,null,null,null,null,null,null,null,null,null,null,null,null,null,null,null,"[Nome]"]
[null,null,"[Nome]",null,null,null,null,null,null,null,null,null,null,null,null,null,null,null,null,null,null,null,null,null,null,null,null,null,null,null,null,null,null,null,"[Indirizzo]"]
[null,null,"[Indirizzo amministratore]",null,null,null,null,null,null,null,null,null,null,null,null,null,null,null,null,null,null,null,null,null,null,null,null,null,null,null,null,null,null,null,"[e-mail condominio]"]
[null,null,"[cellulare amministratore]",null,null,null,null,null,null,null,null,null,null,null,null,null,null,null,null,null,null,null,null,null,null,null,null,null,null,null,null,null,null,null,"[numero c.c.p.]"]
[null,null,null,null,null,null,null,null,null,null,null,null,null,null,null,null,null,null,null,null,null,null,null,null,null,null,null,null,null,null,null,null,null,null,"[IBAN]"]
[null,null,null,null,null,null,null,null,null,null,null,null,null,null,null,null,null,null,null,null,null,null,null,null,null,null,null,null,null,null,null,null,null,null,"[C.F.]"]
[]
[]
[null,null,null,null,null,null,null,null,null,null,null,null,null,null,null,null,null,"[Titolo del Condomino]"]
[null,null,null,null,null,null,null,null,null,null,null,null,null,null,null,null,null,"[Condomino]"]
[null,null,null,null,null,null,null,null,null,null,null,null,null,null,null,null,null,"[Referente o IndirizzoVia]"]
[null,null,null,null,null,null,null,null,null,null,null,null,null,null,null,null,null,"[IndirizzoVia o IndirizzoCittà]"]
[null,null,null,null,null,null,null,null,null,null,null,null,null,null,null,null,null,"[vuoto o IndirizzoCittà]"]
[]
[]
[]
[null,null,null,"RICEVUTA DI AVVENUTA CONSEGNA CONVOCAZIONE ASSEMBLEA"]
[]
[null,null,null,"Il/La sottoscritto/a",null,null,null,null,null,null,null,"_____________________________________________________________"]
[]
[null,null,null,"dichiara di aver ricevuta dall'Amministratore la lettera, con tutti gli allegati, di convocazione dell'Assemblea Condominiale per i giorni 27 e 28 giugno 2023, rispettivamente in prima e seconda convocazione. "]
[]
[null,null,null,"Dichiara inoltre di aver accettato tale lettera in qualità di "]
[]
[null,null,null,null,"¨",null,"Condomino intestatario"]
[]
[null,null,null,null,"¨",null,"Familiare"]
[]
[null,null,null,null,"¨",null,"____________________________"]
[]
[null,null,null,"e si impegna, se non condomino intestario , a far avere il tutto, nel più breve tempo possibile, al condomino intestatario."]
[]
[]
[]
[]
[null,null,null,"La consegna è avvenuta in data  ______________________"]
[]
[]
[null,null,null,null,null,null,null,null,null,null,null,null,null,null,null,null,null,null,null,null,null,"In fede"]

{"sheet":"mr02","index":28,"n_rows":43,"n_cols":35,"rows_kept":43,"cut":false,"hidden":true,"merged":[[0,1,0,35],[20,11,20,34],[22,3,22,34],[36,3,37,34],[40,3,40,34]]}
[null,"Il modulo è utilizzato dalla procedura per creare la ricevuta di avvenuta consegna a mano di documenti condominiali.\nOccorre variare il testo in blu che individua i documenti.\nLe ricevute create sono ad uso dell'amministratore."]
[]
[null,null,"[Incarico dell'Amministrazione]",null,null,null,null,null,null,null,null,null,null,null,null,null,null,null,null,null,null,null,null,null,null,null,null,null,null,null,null,null,null,null,"[Nome]"]
[null,null,"[Nome]",null,null,null,null,null,null,null,null,null,null,null,null,null,null,null,null,null,null,null,null,null,null,null,null,null,null,null,null,null,null,null,"[Indirizzo]"]
[null,null,"[Indirizzo amministratore]",null,null,null,null,null,null,null,null,null,null,null,null,null,null,null,null,null,null,null,null,null,null,null,null,null,null,null,null,null,null,null,"[e-mail condominio]"]
[null,null,"[cellulare amministratore]",null,null,null,null,null,null,null,null,null,null,null,null,null,null,null,null,null,null,null,null,null,null,null,null,null,null,null,null,null,null,null,"[numero c.c.p.]"]
[null,null,null,null,null,null,null,null,null,null,null,null,null,null,null,null,null,null,null,null,null,null,null,null,null,null,null,null,null,null,null,null,null,null,"[IBAN]"]
[null,null,null,null,null,null,null,null,null,null,null,null,null,null,null,null,null,null,null,null,null,null,null,null,null,null,null,null,null,null,null,null,null,null,"[C.F.]"]
[]
[]
[null,null,null,null,null,null,null,null,null,null,null,null,null,null,null,null,null,"[Titolo del Condomino]"]
[null,null,null,null,null,null,null,null,null,null,null,null,null,null,null,null,null,"[Condomino]"]
[null,null,null,null,null,null,null,null,null,null,null,null,null,null,null,null,null,"[Referente o IndirizzoVia]"]
[null,null,null,null,null,null,null,null,null,null,null,null,null,null,null,null,null,"[IndirizzoVia o IndirizzoCittà]"]
[null,null,null,null,null,null,null,null,null,null,null,null,null,null,null,null,null,"[vuoto o IndirizzoCittà]"]
[]
[]
[]
[null,null,null,"RICEVUTA DI AVVENUTA CONSEGNA DI DOCUMENTI"]
[]
[null,null,null,"Il/La sottoscritto/a   ",null,null,null,null,null,null,null,"________________________________________________________________"]
[]
[null,null,null,"dichiara di aver ricevuto dall'Amministratore i seguenti documenti condominiali, indirizzati all'intestatario del presente modulo:"]
[]
[null,null,null,"●"," il verbale relativo all'assemblea condominiale di giorno 28/06/2023"]
[]
[]
[]
[null,null,null,"Dichiara inoltre di aver accettato tali documenti in qualità di "]
[]
[null,null,null,null,"¨",null,"Condomino intestatario"]
[]
[null,null,null,null,"¨",null,"Familiare"]
[]
[null,null,null,null,"¨",null,"____________________________"]
[]
[null,null,null,"e si impegna, se non condomino intestario , a farli avere, nel più breve tempo possibile, al condomino intestatario."]
[]
[]
[]
[null,null,null,"La consegna è avvenuta in data  ______________________"]
[]
[null,null,null,null,null,null,null,null,null,null,null,null,null,null,null,null,null,null,null,null,null,"In fede"]

{"sheet":"md01","index":29,"n_rows":30,"n_cols":35,"rows_kept":30,"cut":false,"hidden":true,"merged":[[24,3,25,34],[0,1,0,35],[18,2,18,34],[22,11,22,34]]}
[null,"Il modulo è utilizzato dalla procedura per creare la delega di rappresentanza dei condomini ad una assemblea condominiale.\nOccorre variare il testo in blu che individua l'assemblea.\nLe deleghe create sono date dall'amministratore ai singoli condomini."]
[]
[null,null,"[Incarico dell'Amministrazione]",null,null,null,null,null,null,null,null,null,null,null,null,null,null,null,null,null,null,null,null,null,null,null,null,null,null,null,null,null,null,null,"[Nome]"]
[null,null,"[Nome]",null,null,null,null,null,null,null,null,null,null,null,null,null,null,null,null,null,null,null,null,null,null,null,null,null,null,null,null,null,null,null,"[Indirizzo]"]
[null,null,"[Indirizzo amministratore]",null,null,null,null,null,null,null,null,null,null,null,null,null,null,null,null,null,null,null,null,null,null,null,null,null,null,null,null,null,null,null,"[e-mail condominio]"]
[null,null,"[cellulare amministratore]",null,null,null,null,null,null,null,null,null,null,null,null,null,null,null,null,null,null,null,null,null,null,null,null,null,null,null,null,null,null,null,"[numero c.c.p.]"]
[null,null,null,null,null,null,null,null,null,null,null,null,null,null,null,null,null,null,null,null,null,null,null,null,null,null,null,null,null,null,null,null,null,null,"[IBAN]"]
[null,null,null,null,null,null,null,null,null,null,null,null,null,null,null,null,null,null,null,null,null,null,null,null,null,null,null,null,null,null,null,null,null,null,"[C.F.]"]
[]
[]
[null,null,null,null,null,null,null,null,null,null,null,null,null,null,null,null,null,"[Titolo del Condomino]"]
[null,null,null,null,null,null,null,null,null,null,null,null,null,null,null,null,null,"[Condomino]"]
[null,null,null,null,null,null,null,null,null,null,null,null,null,null,null,null,null,"[Referente o IndirizzoVia]"]
[null,null,null,null,null,null,null,null,null,null,null,null,null,null,null,null,null,"[IndirizzoVia o IndirizzoCittà]"]
[null,null,null,null,null,null,null,null,null,null,null,null,null,null,null,null,null,"[vuoto o IndirizzoCittà]"]
[]
[]
[]
[null,null,"DELEGA DI RAPPRESENTANZA ASSEMBLEA"]
[]
[null,null,null,"Il/La sottoscritto/a ",null,null,null,null,null,null,null,"________________________________________________________________","________________________________________________________________","________________________________________________________________","________________________________________________________________","________________________________________________________________","________________________________________________________________","________________________________________________________________","________________________________________________________________","________________________________________________________________","________________________________________________________________","________________________________________________________________","________________________________________________________________","________________________________________________________________","________________________________________________________________","________________________________________________________________","________________________________________________________________","________________________________________________________________","________________________________________________________________","________________________________________________________________","________________________________________________________________","________________________________________________________________","________________________________________________________________","________________________________________________________________"]
[]
[null,null,null,"delega il sig./ la sig.ra ",null,null,null,null,null,null,null,"________________________________________________________________"]
[]
[null,null,null,"a rappresentarlo/la nell'Assemblea dei Condomini convocata per giorno  martedì 27 giugno 2023  ore 20,00 in prima convocazione e per giorno mercoledì 28 giugno 2023 ore 16,30 in eventuale seconda convocazione ed a votare gli argomenti posti all'ordine del giorno, con promessa, sin d'ora, di approvare ogni decisione del delegato/a."]
[]
[]
[null,null,null,"_____________________, lì ______________________"]
[]
[null,null,null,null,null,null,null,null,null,null,null,null,null,null,null,null,null,null,null,null,null,null,null,null,null,"In fede"]

{"sheet":"mRICEVUTA","index":30,"n_rows":28,"n_cols":22,"rows_kept":28,"cut":false,"hidden":true,"merged":[[27,9,27,23],[21,2,21,5],[21,10,21,20],[21,21,21,23],[22,2,22,5],[22,10,22,20],[22,21,22,23],[23,4,23,5],[23,18,23,20],[23,21,23,23],[25,10,25,16],[25,17,25,23],[19,10,19,20],[19,21,19,23],[20,2,20,5],[20,10,20,20],[20,21,20,23],[9,2,9,6],[9,16,9,22],[10,2,11,6],[10,16,10,22],[11,16,11,22],[11,10,11,14],[9,10,9,14],[14,2,14,6],[16,2,16,6],[2,8,26,8],[3,17,4,19],[12,16,12,22],[13,5,13,6],[14,11,14,22],[17,2,17,5],[17,10,17,20],[17,21,17,23],[18,2,18,5],[18,10,18,20],[18,21,18,23],[19,2,19,5],[3,20,4,22],[6,18,6,20]]}
[]
[]
[null,null,"Condominio",null,null,"Matrice della ricevuta n.",null,null,"& ----------------------------------------------------------------------------------------------------------------------------",null,"Condominio"]
[null,null,{"$f":"K4","v":"Condominio Palazzo Duck"},null,null,{"$f":"U4","v":0},null,null,null,null,"Condominio Palazzo Duck",null,null,null,null,null,null,"RICEVUTA n."]
[null,null,{"$f":"K5","v":"Viale dei Platani 1"},null,null,null,null,null,null,null,"Viale dei Platani 1"]
[null,null,{"$f":"K6","v":"PAPEROPOLI"},null,null,"Data",null,null,null,null,"PAPEROPOLI"]
[null,null,{"$f":"K7","v":"C.F. 99999990799"},null,null,{"$f":"S7","v":0},null,null,null,null,"C.F. 99999990799",null,null,null,null,null,null,"Data "]
[]
[]
[null,null,"Condomino",null,null,null,null,null,null,null,"Ricevute dal Condomino"]
[null,null,{"$f":"Q10","v":0},null,null,null,null,null,null,null,"Unità immobiliare"]
[]
[]
[null,null,{"$f":"K11","v":"Unità immobiliare"}]
[null,null,null,null,null,null,null,null,null,null,"€"]
[]
[null,null,"CAUSALE",null,null,null,null,null,null,null,"per"]
[null,null,{"$f":"K18","v":0},null,null,null,{"$f":"V18","v":0}]
[null,null,0,null,null,null,0]
[null,null,0,null,null,null,0]
[null,null,0,null,null,null,0]
[null,null,0,null,null,null,0]
[null,null,0,null,null,null,0]
[null,null,null,null,"TOTALE RICEVUTO",null,{"$f":"SUM(G18:G23)","v":0},null,null,null,null,null,null,null,null,null,null,null,"TOTALE RICEVUTO   ",null,null,{"$f":"SUM(V18:X23)","v":0}]
[]
[null,null,null,null,null,null,null,null,null,null,"firma dell'Amministratore",null,null,null,null,null,null,"La presente ricevuta viene rilasciata s.b.f. degli assegni e con riserva di esigere ogni altra somma che risultasse dovuta in seguito a rendiconto consuntivo, nuovi accertamenti, nuove delibere dell'Assemblea o rate pregresse non pagate."]
[]
[null,"& ---------------------------------------------------------------------------------------------------------------------------------------",null,null,null,null,null,null,null,"&---------------------------------------------------------------------------------------------------------------------------------------------------------------------------------------"]

{"sheet":"mBOLLETTINO","index":31,"n_rows":25,"n_cols":69,"rows_kept":25,"cut":false,"hidden":true,"merged":[[23,64,23,66],[7,68,19,68],[8,2,8,30],[9,2,9,30],[11,2,11,30],[11,33,11,66],[12,2,12,30],[12,33,12,66],[14,2,14,20],[15,2,15,20],[19,2,19,20],[6,47,6,66],[3,2,4,3],[3,4,4,5],[3,33,4,34],[5,33,6,37],[6,11,6,30]]}
[]
[null,"\" -------------------------------------------------------------------------------------------------------------------------------------------------------------------------------------------------------------------------------------------------------------------------------------------------------------------------------------------"]
[null,null,"CONTI CORRENTI POSTALI - Ricevuta di Versamento",null,null,null,null,null,null,null,null,null,null,null,null,null,null,null,null,null,null,null,null,null,null,null,"Banco Posta",null,null,null,null,null,null,"CONTI CORRENTI POSTALI - Ricevuta di Accredito",null,null,null,null,null,null,null,null,null,null,null,null,null,null,null,null,null,null,null,null,null,null,null,null,null,null,null,"Banco Posta"]
[null,null,"€",null,"sul\nC/C n.",null,null,null,null,null,null,null,null,null,null,null,null,null,null,null,null,null,null,null,null,null,null,null,null,null,null,null,null,"€"]
[null,null,null,null,null,null,{"$f":"IF(AO5<>\"\",AO5,\"\")","v":""},{"$f":"IF(AP5<>\"\",AP5,\"\")","v":""},4,0,1,0,7,7,2,3,3,4,null,null,"di Euro",{"$f":"IF(BF5<>\"\",BF5,\"\")","v":""},{"$f":"IF(BG5<>\"\",BG5,\"\")","v":""},"","","","","","","","",null,null,null,null,"sul C/C n.",null,null,null,null,null,null,4,0,1,0,7,7,2,3,3,4,null,"di Euro",null,null,""]
[null,null,null,null,null,null,null,null,null,null,null,null,null,null,null,null,null,null,null,null,null,null,null,null,null,null,null,null,null,null,null,null,null,"TD 123"]
[null,null,"IMPORTO IN LETTERE",null,null,null,null,null,null,null,null,{"$f":"IF(AV7<>\"\",AV7,\"\")","v":""},null,null,null,null,null,null,null,null,null,null,null,null,null,null,null,null,null,null,null,null,null,null,null,null,null,null,null,"IMPORTO IN LETTERE"]
[null,null,"INTESTATO A",null,null,null,null,null,null,null,null,null,null,null,null,null,null,null,null,null,null,null,null,null,null,null,null,null,null,null,null,null,null,"INTESTATO A",null,null,null,null,null,null,null,null,null,null,null,null,null,null,null,null,null,null,null,null,null,null,null,null,null,null,null,null,null,null,null,null,null,null,"Mod. CH 8 BIS - EP0934 - MOD. 12401 (EX W127902E) -St. (1c) Ed. 05"]
[null,null,"Condominio Palazzo Duck",null,null,null,null,null,null,null,null,null,null,null,null,null,null,null,null,null,null,null,null,null,null,null,null,null,null,null,null,null,null,"C","o","n","d","o","m","i","n","i","o"," ","P","a","l","a","z","z","o"," ","D","u","c","k"]
[]
[null,null,"CAUSALE",null,null,null,null,null,null,null,null,null,null,null,null,null,null,null,null,null,null,null,null,null,null,null,null,null,null,null,null,null,null,"CAUSALE"]
[null,null,{"$f":"IF(AH12<>\"\",AH12,\"\")","v":""}]
[null,null,{"$f":"IF(AH13<>\"\",AH13,\"\")","v":""}]
[null,null,"ESEGUITO DA",null,null,null,null,null,null,null,null,null,null,null,null,null,null,null,null,null,null,null,null,null,null,null,null,null,null,null,null,null,null,null,null,null,null,null,null,null,null,null,null,null,null,"ESEGUITO DA"]
[]
[]
[null,null,"VIA-PIAZZA ",null,null,null,null,null,null,null,null,null,null,null,null,null,null,null,null,null,null,null,null,null,null,null,null,null,null,null,null,null,null,null,null,null,null,null,null,null,null,null,null,null,null,"VIA - PIAZZA"]
[]
[null,null,"CAP ",null,null,null,null,null,null,null,null,null,null,null,null,null,null,null,null,null,null,null,null,null,null,null,null,null,null,null,null,null,null,null,null,null,null,null,null,null,null,null,null,null,null,"CAP",null,null,null,null,null,"LOCALITÀ"]
[]
[null,null,"LOCALITÀ"]
[null,null,null,null,null,null,null,null,null,null,null,null,null,null,null,null,null,null,null,null,null,null,"BOLLO DELL'UFFICIO POSTALE",null,null,null,null,null,null,null,null,null,null,null,"BOLLO DELL'UFFICIO POSTALE",null,null,null,null,null,null,null,null,null,null,null,null,null,"IMPORTANTE NON SCRIVERE NELLA ZONA SOTTOSTANTE"]
[null,null,null,null,null,null,null,null,null,null,null,null,null,null,null,null,null,null,null,null,null,null,null,null,null,null,null,null,null,null,null,null,null,null,null,"codice bancoposta",null,null,null,null,null,null,null,null,null,null,null,null,null,null,null,null,null,"importo in euro",null,null,null,null,"numero conto",null,null,null,null,null,"tipo documento"]
[null,null,null,null,null,null,null,null,null,null,null,null,null,null,null,null,null,null,null,null,null,null,null,null,null,null,null,null,null,null,null,null,null,null,null,null,null,null,null,null,null,null,null,null,null,null,null,null,null,null,null,null,null,null,null,null,null,null,null,null,null,null,null,null,"123>"]
[null,"\" ------------------------------------------------------------------------------------------------------------------------------------------------------------------------------------------------------------------------------------------------------------------------------------------------------------------------------------------------"]

{"sheet":"mCOPERTINA","index":32,"n_rows":50,"n_cols":2,"rows_kept":50,"cut":false,"hidden":true,"merged":[[49,1,50,8],[2,1,2,8],[3,1,3,8],[4,1,4,8],[5,1,5,8],[16,3,16,5],[17,2,18,7],[37,1,37,8],[40,2,40,7],[43,1,44,8],[45,1,46,8],[47,1,48,8]]}
[]
[null,"   "]
[null,"[Condominio]"]
[null,"[Indirizzo Condominio]\n"]
[null,"[Codice fiscale]"]
[]
[]
[]
[]
[]
[]
[]
[]
[]
[]
[]
[]
[]
[]
[]
[]
[]
[]
[]
[]
[]
[]
[]
[]
[]
[]
[]
[]
[]
[]
[]
[]
[]
[]
[]
[]
[]
[]
[null,"[AMMINISTRATORE]"]
[]
[null,"[nome Amministratore]"]
[]
[null,"[Indirizzo Amministratore]"]
[]
[null,"[Recapiti telefonici]"]

{"sheet":"iPromemoria1","index":33,"n_rows":100,"n_cols":27,"rows_kept":100,"cut":false,"hidden":true,"merged":[]}
[null,"Il foglio è  a disposizione dell'utilizzatore quale promemoria di operazioni o eventi condominiali.\nÈ consentito variare i valori di tutte le celle, solo che se si esporta il condominio saranno esportati solo le celle dell'intervallo A1 : Z100",null,null,null,null,null,null,null,null,null,null,null,null,null,null,null,null,null,null,null,null,null,null,null,null,0]
[null,"PROSPETTO  DELLE CONSEGNE AI CONDOMINI DI DOCUMENTAZIONE CONDOMINIALE"]
[null,"n.","CONDOMINO","CONVOCAZIONE\nASSEMBLEA\nxx/yy mm aaaa","VERBALE\nASSEMBLEA\ndd mmm aaa","INFORMATIVA\nPRIVACY","COMUNICAZIONE\ndd mmm aaaa",null,null,null,null,null,null,null,null,null,null,null,null,null,null,null,null,null,null,""]
[null,"",null,"Raccom. Postale","Raccom. Postale","Raccom. Postale","e-mail",null,null,null,null,null,null,null,null,null,null,null,null,null,null,null,null,null,null,""]
[null,"",null,"e-mail","Raccom. Postale","Raccom. Postale","e-mail",null,null,null,null,null,null,null,null,null,null,null,null,null,null,null,null,null,null,""]
[null,"",null,"Consegna a mano","Raccom. Postale","Raccom. Postale","per posta",null,null,null,null,null,null,null,null,null,null,null,null,null,null,null,null,null,null,""]
[null,"",null,"e-mail","da non consegnare","e-mail","e-mail",null,null,null,null,null,null,null,null,null,null,null,null,null,null,null,null,null,null,""]
[null,"",null,"e-mail","Raccom. Postale","Raccom. Postale","e-mail",null,null,null,null,null,null,null,null,null,null,null,null,null,null,null,null,null,null,""]
[null,"",null,"Raccom. Postale","e-mail","e-mail","e-mail",null,null,null,null,null,null,null,null,null,null,null,null,null,null,null,null,null,null,""]
[null,"",null,"Consegna a mano","Raccom. Postale","Raccom. Postale","Consegna a mano",null,null,null,null,null,null,null,null,null,null,null,null,null,null,null,null,null,null,""]
[null,"",null,"e-mail","da non consegnare","e-mail","e-mail",null,null,null,null,null,null,null,null,null,null,null,null,null,null,null,null,null,null,""]
[null,"",null,"e-mail","da non consegnare","e-mail","e-mail",null,null,null,null,null,null,null,null,null,null,null,null,null,null,null,null,null,null,""]
[null,"",null,"e-mail","da non consegnare","e-mail","e-mail",null,null,null,null,null,null,null,null,null,null,null,null,null,null,null,null,null,null,""]
[null,"",null,"e-mail","da non consegnare","e-mail","e-mail",null,null,null,null,null,null,null,null,null,null,null,null,null,null,null,null,null,null,""]
[null,"",null,"e-mail","Raccom. Postale","Raccom. Postale","e-mail",null,null,null,null,null,null,null,null,null,null,null,null,null,null,null,null,null,null,""]
[null,"",null,"e-mail","da non consegnare","e-mail","e-mail",null,null,null,null,null,null,null,null,null,null,null,null,null,null,null,null,null,null,""]
[null,"",null,"Raccom. Postale","Raccom. Postale","Raccom. Postale","Consegna a mano",null,null,null,null,null,null,null,null,null,null,null,null,null,null,null,null,null,null,""]
[null,"",null,"Raccom. Postale","Raccom. Postale","Raccom. Postale","Consegna a mano",null,null,null,null,null,null,null,null,null,null,null,null,null,null,null,null,null,null,""]
[null,"",null,"e-mail","da non consegnare","e-mail","e-mail",null,null,null,null,null,null,null,null,null,null,null,null,null,null,null,null,null,null,""]
[null,"",null,null,null,null,null,null,null,null,null,null,null,null,null,null,null,null,null,null,null,null,null,null,null,""]
[null,"",null,null,null,null,null,null,null,null,null,null,null,null,null,null,null,null,null,null,null,null,null,null,null,""]
[null,"",null,null,null,null,null,null,null,null,null,null,null,null,null,null,null,null,null,null,null,null,null,null,null,""]
[null,"",null,null,null,null,null,null,null,null,null,null,null,null,null,null,null,null,null,null,null,null,null,null,null,""]
[null,"",null,null,null,null,null,null,null,null,null,null,null,null,null,null,null,null,null,null,null,null,null,null,null,""]
[null,"",null,null,null,null,null,null,null,null,null,null,null,null,null,null,null,null,null,null,null,null,null,null,null,""]
[null,"",null,null,null,null,null,null,null,null,null,null,null,null,null,null,null,null,null,null,null,null,null,null,null,""]
[null,"",null,null,null,null,null,null,null,null,null,null,null,null,null,null,null,null,null,null,null,null,null,null,null,""]
[null,"",null,null,null,null,null,null,null,null,null,null,null,null,null,null,null,null,null,null,null,null,null,null,null,""]
[null,"",null,null,null,null,null,null,null,null,null,null,null,null,null,null,null,null,null,null,null,null,null,null,null,""]
[null,"",null,null,null,null,null,null,null,null,null,null,null,null,null,null,null,null,null,null,null,null,null,null,null,""]
[null,"",null,null,null,null,null,null,null,null,null,null,null,null,null,null,null,null,null,null,null,null,null,null,null,""]
[null,"",null,null,null,null,null,null,null,null,null,null,null,null,null,null,null,null,null,null,null,null,null,null,null,""]
[null,"",null,null,null,null,null,null,null,null,null,null,null,null,null,null,null,null,null,null,null,null,null,null,null,""]
[null,"",null,null,null,null,null,null,null,null,null,null,null,null,null,null,null,null,null,null,null,null,null,null,null,""]
[null,"",null,null,null,null,null,null,null,null,null,null,null,null,null,null,null,null,null,null,null,null,null,null,null,""]
[null,"",null,null,null,null,null,null,null,null,null,null,null,null,null,null,null,null,null,null,null,null,null,null,null,""]
[null,"",null,null,null,null,null,null,null,null,null,null,null,null,null,null,null,null,null,null,null,null,null,null,null,""]
[null,"",null,null,null,null,null,null,null,null,null,null,null,null,null,null,null,null,null,null,null,null,null,null,null,""]
[null,"",null,null,null,null,null,null,null,null,null,null,null,null,null,null,null,null,null,null,null,null,null,null,null,""]
[null,"",null,null,null,null,null,null,null,null,null,null,null,null,null,null,null,null,null,null,null,null,null,null,null,""]
[null,"",null,null,null,null,null,null,null,null,null,null,null,null,null,null,null,null,null,null,null,null,null,null,null,""]
[null,"",null,null,null,null,null,null,null,null,null,null,null,null,null,null,null,null,null,null,null,null,null,null,null,""]
[null,"",null,null,null,null,null,null,null,null,null,null,null,null,null,null,null,null,null,null,null,null,null,null,null,""]
[null,"",null,null,null,null,null,null,null,null,null,null,null,null,null,null,null,null,null,null,null,null,null,null,null,""]
[null,"",null,null,null,null,null,null,null,null,null,null,null,null,null,null,null,null,null,null,null,null,null,null,null,""]
[null,"",null,null,null,null,null,null,null,null,null,null,null,null,null,null,null,null,null,null,null,null,null,null,null,""]
[null,"",null,null,null,null,null,null,null,null,null,null,null,null,null,null,null,null,null,null,null,null,null,null,null,""]
[null,"",null,null,null,null,null,null,null,null,null,null,null,null,null,null,null,null,null,null,null,null,null,null,null,""]
[null,"",null,null,null,null,null,null,null,null,null,null,null,null,null,null,null,null,null,null,null,null,null,null,null,""]
[null,"",null,null,null,null,null,null,null,null,null,null,null,null,null,null,null,null,null,null,null,null,null,null,null,""]
[null,"",null,null,null,null,null,null,null,null,null,null,null,null,null,null,null,null,null,null,null,null,null,null,null,""]
[null,"",null,null,null,null,null,null,null,null,null,null,null,null,null,null,null,null,null,null,null,null,null,null,null,""]
[null,"",null,null,null,null,null,null,null,null,null,null,null,null,null,null,null,null,null,null,null,null,null,null,null,""]
[null,"",null,null,null,null,null,null,null,null,null,null,null,null,null,null,null,null,null,null,null,null,null,null,null,""]
[null,"",null,null,null,null,null,null,null,null,null,null,null,null,null,null,null,null,null,null,null,null,null,null,null,""]
[null,"",null,null,null,null,null,null,null,null,null,null,null,null,null,null,null,null,null,null,null,null,null,null,null,""]
[null,"",null,null,null,null,null,null,null,null,null,null,null,null,null,null,null,null,null,null,null,null,null,null,null,""]
[null,"",null,null,null,null,null,null,null,null,null,null,null,null,null,null,null,null,null,null,null,null,null,null,null,""]
[null,"",null,null,null,null,null,null,null,null,null,null,null,null,null,null,null,null,null,null,null,null,null,null,null,""]
[null,"",null,null,null,null,null,null,null,null,null,null,null,null,null,null,null,null,null,null,null,null,null,null,null,""]
[null,"",null,null,null,null,null,null,null,null,null,null,null,null,null,null,null,null,null,null,null,null,null,null,null,""]
[null,"",null,null,null,null,null,null,null,null,null,null,null,null,null,null,null,null,null,null,null,null,null,null,null,""]
[null,"",null,null,null,null,null,null,null,null,null,null,null,null,null,null,null,null,null,null,null,null,null,null,null,""]
[null,"",null,null,null,null,null,null,null,null,null,null,null,null,null,null,null,null,null,null,null,null,null,null,null,""]
[null,"",null,null,null,null,null,null,null,null,null,null,null,null,null,null,null,null,null,null,null,null,null,null,null,""]
[null,"",null,null,null,null,null,null,null,null,null,null,null,null,null,null,null,null,null,null,null,null,null,null,null,""]
[null,"",null,null,null,null,null,null,null,null,null,null,null,null,null,null,null,null,null,null,null,null,null,null,null,""]
[null,"",null,null,null,null,null,null,null,null,null,null,null,null,null,null,null,null,null,null,null,null,null,null,null,""]
[null,"",null,null,null,null,null,null,null,null,null,null,null,null,null,null,null,null,null,null,null,null,null,null,null,""]
[null,"",null,null,null,null,null,null,null,null,null,null,null,null,null,null,null,null,null,null,null,null,null,null,null,""]
[null,"",null,null,null,null,null,null,null,null,null,null,null,null,null,null,null,null,null,null,null,null,null,null,null,""]
[null,"",null,null,null,null,null,null,null,null,null,null,null,null,null,null,null,null,null,null,null,null,null,null,null,""]
[null,"",null,null,null,null,null,null,null,null,null,null,null,null,null,null,null,null,null,null,null,null,null,null,null,""]
[null,"",null,null,null,null,null,null,null,null,null,null,null,null,null,null,null,null,null,null,null,null,null,null,null,""]
[null,"",null,null,null,null,null,null,null,null,null,null,null,null,null,null,null,null,null,null,null,null,null,null,null,""]
[null,"",null,null,null,null,null,null,null,null,null,null,null,null,null,null,null,null,null,null,null,null,null,null,null,""]
[null,"",null,null,null,null,null,null,null,null,null,null,null,null,null,null,null,null,null,null,null,null,null,null,null,""]
[null,"",null,null,null,null,null,null,null,null,null,null,null,null,null,null,null,null,null,null,null,null,null,null,null,""]
[null,"",null,null,null,null,null,null,null,null,null,null,null,null,null,null,null,null,null,null,null,null,null,null,null,""]
[null,"",null,null,null,null,null,null,null,null,null,null,null,null,null,null,null,null,null,null,null,null,null,null,null,""]
[null,"",null,null,null,null,null,null,null,null,null,null,null,null,null,null,null,null,null,null,null,null,null,null,null,""]
[null,"",null,null,null,null,null,null,null,null,null,null,null,null,null,null,null,null,null,null,null,null,null,null,null,""]
[null,"",null,null,null,null,null,null,null,null,null,null,null,null,null,null,null,null,null,null,null,null,null,null,null,""]
[null,"",null,null,null,null,null,null,null,null,null,null,null,null,null,null,null,null,null,null,null,null,null,null,null,""]
[null,"",null,null,null,null,null,null,null,null,null,null,null,null,null,null,null,null,null,null,null,null,null,null,null,""]
[null,"",null,null,null,null,null,null,null,null,null,null,null,null,null,null,null,null,null,null,null,null,null,null,null,""]
[null,"",null,null,null,null,null,null,null,null,null,null,null,null,null,null,null,null,null,null,null,null,null,null,null,""]
[null,"",null,null,null,null,null,null,null,null,null,null,null,null,null,null,null,null,null,null,null,null,null,null,null,""]
[null,"",null,null,null,null,null,null,null,null,null,null,null,null,null,null,null,null,null,null,null,null,null,null,null,""]
[null,"",null,null,null,null,null,null,null,null,null,null,null,null,null,null,null,null,null,null,null,null,null,null,null,""]
[null,"",null,null,null,null,null,null,null,null,null,null,null,null,null,null,null,null,null,null,null,null,null,null,null,""]
[null,"",null,null,null,null,null,null,null,null,null,null,null,null,null,null,null,null,null,null,null,null,null,null,null,""]
[null,"",null,null,null,null,null,null,null,null,null,null,null,null,null,null,null,null,null,null,null,null,null,null,null,""]
[null,"",null,null,null,null,null,null,null,null,null,null,null,null,null,null,null,null,null,null,null,null,null,null,null,""]
[null,"",null,null,null,null,null,null,null,null,null,null,null,null,null,null,null,null,null,null,null,null,null,null,null,""]
[null,"",null,null,null,null,null,null,null,null,null,null,null,null,null,null,null,null,null,null,null,null,null,null,null,""]
[null,"",null,null,null,null,null,null,null,null,null,null,null,null,null,null,null,null,null,null,null,null,null,null,null,""]
[null,"",null,null,null,null,null,null,null,null,null,null,null,null,null,null,null,null,null,null,null,null,null,null,null,""]
[null,"",null,null,null,null,null,null,null,null,null,null,null,null,null,null,null,null,null,null,null,null,null,null,null,""]
[null,"",null,null,null,null,null,null,null,null,null,null,null,null,null,null,null,null,null,null,null,null,null,null,null,""]

{"sheet":"iPromemoria2","index":34,"n_rows":100,"n_cols":26,"rows_kept":100,"cut":false,"hidden":true,"merged":[]}
[null,"Il foglio è  a disposizione dell'utilizzatore quale promemoria di operazioni o eventi condominiali.\nÈ possibile utilizzare tutte le celle del foglio, solo che se si esporta il condominio saranno esportati solo le celle dell'intervallo A1 : Z100"]
[null,"PROSPETTO  DI ADEMPIMENTI CONDOMINIALI DA COMPIERE"]
[null,"n.","ADEMPIMENTO","DATA",null,null,null,null,null,null,null,null,null,null,null,null,null,null,null,null,null,null,null,null,null,""]
[null,"",null,null,null,null,null,null,null,null,null,null,null,null,null,null,null,null,null,null,null,null,null,null,null,""]
[null,"",null,null,null,null,null,null,null,null,null,null,null,null,null,null,null,null,null,null,null,null,null,null,null,""]
[null,"",null,null,null,null,null,null,null,null,null,null,null,null,null,null,null,null,null,null,null,null,null,null,null,""]
[null,"",null,null,null,null,null,null,null,null,null,null,null,null,null,null,null,null,null,null,null,null,null,null,null,""]
[null,"",null,null,null,null,null,null,null,null,null,null,null,null,null,null,null,null,null,null,null,null,null,null,null,""]
[null,"",null,null,null,null,null,null,null,null,null,null,null,null,null,null,null,null,null,null,null,null,null,null,null,""]
[null,"",null,null,null,null,null,null,null,null,null,null,null,null,null,null,null,null,null,null,null,null,null,null,null,""]
[null,"",null,null,null,null,null,null,null,null,null,null,null,null,null,null,null,null,null,null,null,null,null,null,null,""]
[null,"",null,null,null,null,null,null,null,null,null,null,null,null,null,null,null,null,null,null,null,null,null,null,null,""]
[null,"",null,null,null,null,null,null,null,null,null,null,null,null,null,null,null,null,null,null,null,null,null,null,null,""]
[null,"",null,null,null,null,null,null,null,null,null,null,null,null,null,null,null,null,null,null,null,null,null,null,null,""]
[null,"",null,null,null,null,null,null,null,null,null,null,null,null,null,null,null,null,null,null,null,null,null,null,null,""]
[null,"",null,null,null,null,null,null,null,null,null,null,null,null,null,null,null,null,null,null,null,null,null,null,null,""]
[null,"",null,null,null,null,null,null,null,null,null,null,null,null,null,null,null,null,null,null,null,null,null,null,null,""]
[null,"",null,null,null,null,null,null,null,null,null,null,null,null,null,null,null,null,null,null,null,null,null,null,null,""]
[null,"",null,null,null,null,null,null,null,null,null,null,null,null,null,null,null,null,null,null,null,null,null,null,null,""]
[null,"",null,null,null,null,null,null,null,null,null,null,null,null,null,null,null,null,null,null,null,null,null,null,null,""]
[null,"",null,null,null,null,null,null,null,null,null,null,null,null,null,null,null,null,null,null,null,null,null,null,null,""]
[null,"",null,null,null,null,null,null,null,null,null,null,null,null,null,null,null,null,null,null,null,null,null,null,null,""]
[null,"",null,null,null,null,null,null,null,null,null,null,null,null,null,null,null,null,null,null,null,null,null,null,null,""]
[null,"",null,null,null,null,null,null,null,null,null,null,null,null,null,null,null,null,null,null,null,null,null,null,null,""]
[null,"",null,null,null,null,null,null,null,null,null,null,null,null,null,null,null,null,null,null,null,null,null,null,null,""]
[null,"",null,null,null,null,null,null,null,null,null,null,null,null,null,null,null,null,null,null,null,null,null,null,null,""]
[null,"",null,null,null,null,null,null,null,null,null,null,null,null,null,null,null,null,null,null,null,null,null,null,null,""]
[null,"",null,null,null,null,null,null,null,null,null,null,null,null,null,null,null,null,null,null,null,null,null,null,null,""]
[null,"",null,null,null,null,null,null,null,null,null,null,null,null,null,null,null,null,null,null,null,null,null,null,null,""]
[null,"",null,null,null,null,null,null,null,null,null,null,null,null,null,null,null,null,null,null,null,null,null,null,null,""]
[null,"",null,null,null,null,null,null,null,null,null,null,null,null,null,null,null,null,null,null,null,null,null,null,null,""]
[null,"",null,null,null,null,null,null,null,null,null,null,null,null,null,null,null,null,null,null,null,null,null,null,null,""]
[null,"",null,null,null,null,null,null,null,null,null,null,null,null,null,null,null,null,null,null,null,null,null,null,null,""]
[null,"",null,null,null,null,null,null,null,null,null,null,null,null,null,null,null,null,null,null,null,null,null,null,null,""]
[null,"",null,null,null,null,null,null,null,null,null,null,null,null,null,null,null,null,null,null,null,null,null,null,null,""]
[null,"",null,null,null,null,null,null,null,null,null,null,null,null,null,null,null,null,null,null,null,null,null,null,null,""]
[null,"",null,null,null,null,null,null,null,null,null,null,null,null,null,null,null,null,null,null,null,null,null,null,null,""]
[null,"",null,null,null,null,null,null,null,null,null,null,null,null,null,null,null,null,null,null,null,null,null,null,null,""]
[null,"",null,null,null,null,null,null,null,null,null,null,null,null,null,null,null,null,null,null,null,null,null,null,null,""]
[null,"",null,null,null,null,null,null,null,null,null,null,null,null,null,null,null,null,null,null,null,null,null,null,null,""]
[null,"",null,null,null,null,null,null,null,null,null,null,null,null,null,null,null,null,null,null,null,null,null,null,null,""]
[null,"",null,null,null,null,null,null,null,null,null,null,null,null,null,null,null,null,null,null,null,null,null,null,null,""]
[null,"",null,null,null,null,null,null,null,null,null,null,null,null,null,null,null,null,null,null,null,null,null,null,null,""]
[null,"",null,null,null,null,null,null,null,null,null,null,null,null,null,null,null,null,null,null,null,null,null,null,null,""]
[null,"",null,null,null,null,null,null,null,null,null,null,null,null,null,null,null,null,null,null,null,null,null,null,null,""]
[null,"",null,null,null,null,null,null,null,null,null,null,null,null,null,null,null,null,null,null,null,null,null,null,null,""]
[null,"",null,null,null,null,null,null,null,null,null,null,null,null,null,null,null,null,null,null,null,null,null,null,null,""]
[null,"",null,null,null,null,null,null,null,null,null,null,null,null,null,null,null,null,null,null,null,null,null,null,null,""]
[null,"",null,null,null,null,null,null,null,null,null,null,null,null,null,null,null,null,null,null,null,null,null,null,null,""]
[null,"",null,null,null,null,null,null,null,null,null,null,null,null,null,null,null,null,null,null,null,null,null,null,null,""]
[null,"",null,null,null,null,null,null,null,null,null,null,null,null,null,null,null,null,null,null,null,null,null,null,null,""]
[null,"",null,null,null,null,null,null,null,null,null,null,null,null,null,null,null,null,null,null,null,null,null,null,null,""]
[null,"",null,null,null,null,null,null,null,null,null,null,null,null,null,null,null,null,null,null,null,null,null,null,null,""]
[null,"",null,null,null,null,null,null,null,null,null,null,null,null,null,null,null,null,null,null,null,null,null,null,null,""]
[null,"",null,null,null,null,null,null,null,null,null,null,null,null,null,null,null,null,null,null,null,null,null,null,null,""]
[null,"",null,null,null,null,null,null,null,null,null,null,null,null,null,null,null,null,null,null,null,null,null,null,null,""]
[null,"",null,null,null,null,null,null,null,null,null,null,null,null,null,null,null,null,null,null,null,null,null,null,null,""]
[null,"",null,null,null,null,null,null,null,null,null,null,null,null,null,null,null,null,null,null,null,null,null,null,null,""]
[null,"",null,null,null,null,null,null,null,null,null,null,null,null,null,null,null,null,null,null,null,null,null,null,null,""]
[null,"",null,null,null,null,null,null,null,null,null,null,null,null,null,null,null,null,null,null,null,null,null,null,null,""]
[null,"",null,null,null,null,null,null,null,null,null,null,null,null,null,null,null,null,null,null,null,null,null,null,null,""]
[null,"",null,null,null,null,null,null,null,null,null,null,null,null,null,null,null,null,null,null,null,null,null,null,null,""]
[null,"",null,null,null,null,null,null,null,null,null,null,null,null,null,null,null,null,null,null,null,null,null,null,null,""]
[null,"",null,null,null,null,null,null,null,null,null,null,null,null,null,null,null,null,null,null,null,null,null,null,null,""]
[null,"",null,null,null,null,null,null,null,null,null,null,null,null,null,null,null,null,null,null,null,null,null,null,null,""]
[null,"",null,null,null,null,null,null,null,null,null,null,null,null,null,null,null,null,null,null,null,null,null,null,null,""]
[null,"",null,null,null,null,null,null,null,null,null,null,null,null,null,null,null,null,null,null,null,null,null,null,null,""]
[null,"",null,null,null,null,null,null,null,null,null,null,null,null,null,null,null,null,null,null,null,null,null,null,null,""]
[null,"",null,null,null,null,null,null,null,null,null,null,null,null,null,null,null,null,null,null,null,null,null,null,null,""]
[null,"",null,null,null,null,null,null,null,null,null,null,null,null,null,null,null,null,null,null,null,null,null,null,null,""]
[null,"",null,null,null,null,null,null,null,null,null,null,null,null,null,null,null,null,null,null,null,null,null,null,null,""]
[null,"",null,null,null,null,null,null,null,null,null,null,null,null,null,null,null,null,null,null,null,null,null,null,null,""]
[null,"",null,null,null,null,null,null,null,null,null,null,null,null,null,null,null,null,null,null,null,null,null,null,null,""]
[null,"",null,null,null,null,null,null,null,null,null,null,null,null,null,null,null,null,null,null,null,null,null,null,null,""]
[null,"",null,null,null,null,null,null,null,null,null,null,null,null,null,null,null,null,null,null,null,null,null,null,null,""]
[null,"",null,null,null,null,null,null,null,null,null,null,null,null,null,null,null,null,null,null,null,null,null,null,null,""]
[null,"",null,null,null,null,null,null,null,null,null,null,null,null,null,null,null,null,null,null,null,null,null,null,null,""]
[null,"",null,null,null,null,null,null,null,null,null,null,null,null,null,null,null,null,null,null,null,null,null,null,null,""]
[null,"",null,null,null,null,null,null,null,null,null,null,null,null,null,null,null,null,null,null,null,null,null,null,null,""]
[null,"",null,null,null,null,null,null,null,null,null,null,null,null,null,null,null,null,null,null,null,null,null,null,null,""]
[null,"",null,null,null,null,null,null,null,null,null,null,null,null,null,null,null,null,null,null,null,null,null,null,null,""]
[null,"",null,null,null,null,null,null,null,null,null,null,null,null,null,null,null,null,null,null,null,null,null,null,null,""]
[null,"",null,null,null,null,null,null,null,null,null,null,null,null,null,null,null,null,null,null,null,null,null,null,null,""]
[null,"",null,null,null,null,null,null,null,null,null,null,null,null,null,null,null,null,null,null,null,null,null,null,null,""]
[null,"",null,null,null,null,null,null,null,null,null,null,null,null,null,null,null,null,null,null,null,null,null,null,null,""]
[null,"",null,null,null,null,null,null,null,null,null,null,null,null,null,null,null,null,null,null,null,null,null,null,null,""]
[null,"",null,null,null,null,null,null,null,null,null,null,null,null,null,null,null,null,null,null,null,null,null,null,null,""]
[null,"",null,null,null,null,null,null,null,null,null,null,null,null,null,null,null,null,null,null,null,null,null,null,null,""]
[null,"",null,null,null,null,null,null,null,null,null,null,null,null,null,null,null,null,null,null,null,null,null,null,null,""]
[null,"",null,null,null,null,null,null,null,null,null,null,null,null,null,null,null,null,null,null,null,null,null,null,null,""]
[null,"",null,null,null,null,null,null,null,null,null,null,null,null,null,null,null,null,null,null,null,null,null,null,null,""]
[null,"",null,null,null,null,null,null,null,null,null,null,null,null,null,null,null,null,null,null,null,null,null,null,null,""]
[null,"",null,null,null,null,null,null,null,null,null,null,null,null,null,null,null,null,null,null,null,null,null,null,null,""]
[null,"",null,null,null,null,null,null,null,null,null,null,null,null,null,null,null,null,null,null,null,null,null,null,null,""]
[null,"",null,null,null,null,null,null,null,null,null,null,null,null,null,null,null,null,null,null,null,null,null,null,null,""]
[null,"",null,null,null,null,null,null,null,null,null,null,null,null,null,null,null,null,null,null,null,null,null,null,null,""]
[null,"",null,null,null,null,null,null,null,null,null,null,null,null,null,null,null,null,null,null,null,null,null,null,null,""]
[null,"",null,null,null,null,null,null,null,null,null,null,null,null,null,null,null,null,null,null,null,null,null,null,null,""]
[null,"",null,null,null,null,null,null,null,null,null,null,null,null,null,null,null,null,null,null,null,null,null,null,null,""]
[null,"",null,null,null,null,null,null,null,null,null,null,null,null,null,null,null,null,null,null,null,null,null,null,null,""]

{"sheet":"iRP_ATTREZZATURE","index":35,"n_rows":70,"n_cols":8,"rows_kept":70,"cut":false,"hidden":true,"merged":[]}
[0,"È consentito variare i valori delle sole celle con sfondo bianco.\nI dati dei prospetti sono solo promemoria dell'utilizzatore, non vengono processati dalla procedura",null,null,null,null,null,0]
[null,{"$f":"iDG!B32","v":"Condominio Palazzo Duck"}]
[null,{"$f":"\"MATERIALI e ATTREZZATURE del CONDOMINIO\"","v":"MATERIALI e ATTREZZATURE del CONDOMINIO"}]
[null,{"$f":"\"al giorno \" & TEXT(MENÙ!AE9,\"gg-mmm-aaaa\")","v":"al giorno 31-dic-2024"}]
[null,"n.","TIPO DI ATTREZZATURA o MATERIALE","MARCA","QUANTITÀ","STATO DI\nCONSERVAZIONE","CUSTODE\n(Amm. / Condom./Altri)"]
[null,1]
[null,2]
[null,3]
[null,4]
[null,5]
[null,6]
[null,7]
[null,8]
[null,9]
[null,10]
[null,11]
[null,12]
[null,13]
[null,14]
[null,15]
[null,16]
[null,17]
[null,18]
[null,19]
[null,20]
[null,21]
[null,22]
[null,23]
[null,24]
[null,25]
[null,26]
[null,27]
[null,28]
[null,29]
[null,30]
[]
[null,{"$f":"\"MATERIALI e ATTREZZATURE del CONDOMINIO\"","v":"MATERIALI e ATTREZZATURE del CONDOMINIO"}]
[null,{"$f":"\"al giorno 1-gen-\" & iDG!B97 & \" (inizio esercizio)\"","v":"al giorno 1-gen-2024 (inizio esercizio)"}]
[null,"n.","TIPO DI ATTREZZATURA o MATERIALE","MARCA","QUANTITÀ","STATO DI\nCONSERVAZIONE","CUSTODE\n(Amm. / Condom./Altri)"]
[null,1]
[null,2]
[null,3]
[null,4]
[null,5]
[null,6]
[null,7]
[null,8]
[null,9]
[null,10]
[null,11]
[null,12]
[null,13]
[null,14]
[null,15]
[null,16]
[null,17]
[null,18]
[null,19]
[null,20]
[null,21]
[null,22]
[null,23]
[null,24]
[null,25]
[null,26]
[null,27]
[null,28]
[null,29]
[null,30]
[0,null,null,null,null,null,null,0]